Haiku Build Log


~/brlcad/build> CC=gcc-x86 CXX=g++-x86 cmake ..
-- The C compiler identification is GNU 5.3.0
-- The CXX compiler identification is GNU 5.3.0
-- Check for working C compiler: /bin/gcc-x86
-- Check for working C compiler: /bin/gcc-x86 -- works
-- Detecting C compiler ABI info
-- Detecting C compiler ABI info - done
-- Detecting C compile features
-- Detecting C compile features - done
-- Check for working CXX compiler: /bin/g++-x86
-- Check for working CXX compiler: /bin/g++-x86 -- works
-- Detecting CXX compiler ABI info
-- Detecting CXX compiler ABI info - done
-- Detecting CXX compile features
-- Detecting CXX compile features - done
**********************************************************
*** Configuring BRL-CAD Release 7.25.0, Build 20160529 ***
**********************************************************
-- Looking for sys/types.h
-- Looking for sys/types.h - found
-- Looking for stdint.h
-- Looking for stdint.h - found
-- Looking for stddef.h
-- Looking for stddef.h - found
-- Check size of void *
-- Check size of void * - done
***********************************************************
*        Stage 1 of 9 - Top Level Configure Options       *
***********************************************************
***********************************************************
*             Stage 2 of 9 - Check for Programs           *
***********************************************************
-- Found SHELL_SUPPORTED: /bin/sh  
-- Performing Test YYTEXT_POINTER
-- Performing Test YYTEXT_POINTER - Success
-- Found LEX: /bin/flex  
-- Could NOT find SWIG (missing:  SWIG_EXECUTABLE SWIG_DIR) 
-- Could NOT find Doxygen (missing:  DOXYGEN_EXECUTABLE) 
***********************************************************
*     Stage 3 of 9 - Check for Compiler Characteristics   *
***********************************************************
-- Performing Test PIPE_C_FLAG_FOUND
-- Performing Test PIPE_C_FLAG_FOUND - Success
-- Performing Test PIPE_CXX_FLAG_FOUND
-- Performing Test PIPE_CXX_FLAG_FOUND - Success
-- Performing Test FNO_STRICT_ALIASING_C_FLAG_FOUND
-- Performing Test FNO_STRICT_ALIASING_C_FLAG_FOUND - Success
-- Performing Test FNO_STRICT_ALIASING_CXX_FLAG_FOUND
-- Performing Test FNO_STRICT_ALIASING_CXX_FLAG_FOUND - Success
-- Performing Test FNO_COMMON_C_FLAG_FOUND
-- Performing Test FNO_COMMON_C_FLAG_FOUND - Success
-- Performing Test FNO_COMMON_CXX_FLAG_FOUND
-- Performing Test FNO_COMMON_CXX_FLAG_FOUND - Success
-- Performing Test FEXCEPTIONS_C_FLAG_FOUND
-- Performing Test FEXCEPTIONS_C_FLAG_FOUND - Success
-- Performing Test FEXCEPTIONS_CXX_FLAG_FOUND
-- Performing Test FEXCEPTIONS_CXX_FLAG_FOUND - Success
-- Performing Test FTEMPLATE_DEPTH_128_CXX_FLAG_FOUND
-- Performing Test FTEMPLATE_DEPTH_128_CXX_FLAG_FOUND - Success
-- Performing Test STD_GNU89_C_FLAG_FOUND
-- Performing Test STD_GNU89_C_FLAG_FOUND - Success
-- Performing Test STD_GNU__98_CXX_FLAG_FOUND
-- Performing Test STD_GNU__98_CXX_FLAG_FOUND - Success
-- Performing Test G_C_FLAG_FOUND
-- Performing Test G_C_FLAG_FOUND - Success
-- Performing Test G_CXX_FLAG_FOUND
-- Performing Test G_CXX_FLAG_FOUND - Success
-- Performing Test GGDB3_C_FLAG_FOUND
-- Performing Test GGDB3_C_FLAG_FOUND - Success
-- Performing Test GGDB3_CXX_FLAG_FOUND
-- Performing Test GGDB3_CXX_FLAG_FOUND - Success
-- Performing Test HAVE_INLINE_KEYWORD
-- Performing Test HAVE_INLINE_KEYWORD - Success
-- Performing Test WERROR_C_FLAG_FOUND
-- Performing Test WERROR_C_FLAG_FOUND - Success
-- Performing Test HAVE_NORETURN_ATTRIBUTE
-- Performing Test HAVE_NORETURN_ATTRIBUTE - Success
-- Performing Test HAVE_ANALYZER_NORETURN_ATTRIBUTE
-- Performing Test HAVE_ANALYZER_NORETURN_ATTRIBUTE - Failed
-- Performing Test HAVE_ALWAYS_INLINE_ATTRIBUTE
-- Performing Test HAVE_ALWAYS_INLINE_ATTRIBUTE - Success
-- Performing Test HAVE_PRINTF12_ATTRIBUTE
-- Performing Test HAVE_PRINTF12_ATTRIBUTE - Success
-- Performing Test HAVE_PRINTF23_ATTRIBUTE
-- Performing Test HAVE_PRINTF23_ATTRIBUTE - Success
-- Performing Test HAVE_SCANF23_ATTRIBUTE
-- Performing Test HAVE_SCANF23_ATTRIBUTE - Success
-- Performing Test QUNUSED_ARGUMENTS_C_FLAG_FOUND
-- Performing Test QUNUSED_ARGUMENTS_C_FLAG_FOUND - Failed
-- Performing Test QUNUSED_ARGUMENTS_CXX_FLAG_FOUND
-- Performing Test QUNUSED_ARGUMENTS_CXX_FLAG_FOUND - Failed
-- Performing Test O3_C_FLAG_FOUND
-- Performing Test O3_C_FLAG_FOUND - Success
-- Performing Test FSTRENGTH_REDUCE_C_FLAG_FOUND
-- Performing Test FSTRENGTH_REDUCE_C_FLAG_FOUND - Success
-- Performing Test FEXPENSIVE_OPTIMIZATIONS_C_FLAG_FOUND
-- Performing Test FEXPENSIVE_OPTIMIZATIONS_C_FLAG_FOUND - Success
-- Performing Test FINLINE_FUNCTIONS_C_FLAG_FOUND
-- Performing Test FINLINE_FUNCTIONS_C_FLAG_FOUND - Success
-- Performing Test FINLINE_LIMIT_10000___PARAM_INLINE_UNIT_GROWTH_300___PARAM_LARGE_FUNCTION_GROWTH_300_C_FLAG_FOUND
-- Performing Test FINLINE_LIMIT_10000___PARAM_INLINE_UNIT_GROWTH_300___PARAM_LARGE_FUNCTION_GROWTH_300_C_FLAG_FOUND - Success
-- Performing Test O3_CXX_FLAG_FOUND
-- Performing Test O3_CXX_FLAG_FOUND - Success
-- Performing Test FSTRENGTH_REDUCE_CXX_FLAG_FOUND
-- Performing Test FSTRENGTH_REDUCE_CXX_FLAG_FOUND - Success
-- Performing Test FEXPENSIVE_OPTIMIZATIONS_CXX_FLAG_FOUND
-- Performing Test FEXPENSIVE_OPTIMIZATIONS_CXX_FLAG_FOUND - Success
-- Performing Test FINLINE_FUNCTIONS_CXX_FLAG_FOUND
-- Performing Test FINLINE_FUNCTIONS_CXX_FLAG_FOUND - Success
-- Performing Test FINLINE_LIMIT_10000___PARAM_INLINE_UNIT_GROWTH_300___PARAM_LARGE_FUNCTION_GROWTH_300_CXX_FLAG_FOUND
-- Performing Test FINLINE_LIMIT_10000___PARAM_INLINE_UNIT_GROWTH_300___PARAM_LARGE_FUNCTION_GROWTH_300_CXX_FLAG_FOUND - Success
-- Performing Test FSTACK_PROTECTOR_ALL_C_FLAG_FOUND
-- Performing Test FSTACK_PROTECTOR_ALL_C_FLAG_FOUND - Failed
-- Performing Test FSTACK_PROTECTOR_ALL_CXX_FLAG_FOUND
-- Performing Test FSTACK_PROTECTOR_ALL_CXX_FLAG_FOUND - Failed
-- Performing Test QSTACKPROTECT_C_FLAG_FOUND
-- Performing Test QSTACKPROTECT_C_FLAG_FOUND - Failed
-- Performing Test QSTACKPROTECT_CXX_FLAG_FOUND
-- Performing Test QSTACKPROTECT_CXX_FLAG_FOUND - Failed
-- Performing Test PEDANTIC_C_FLAG_FOUND
-- Performing Test PEDANTIC_C_FLAG_FOUND - Success
-- Performing Test PEDANTIC_CXX_FLAG_FOUND
-- Performing Test PEDANTIC_CXX_FLAG_FOUND - Success
-- Performing Test PEDANTIC_ERRORS_C_FLAG_FOUND
-- Performing Test PEDANTIC_ERRORS_C_FLAG_FOUND - Success
-- Performing Test WALL_C_FLAG_FOUND
-- Performing Test WALL_C_FLAG_FOUND - Success
-- Performing Test WALL_CXX_FLAG_FOUND
-- Performing Test WALL_CXX_FLAG_FOUND - Success
-- Performing Test WEXTRA_C_FLAG_FOUND
-- Performing Test WEXTRA_C_FLAG_FOUND - Success
-- Performing Test WEXTRA_CXX_FLAG_FOUND
-- Performing Test WEXTRA_CXX_FLAG_FOUND - Success
-- Performing Test WUNDEF_C_FLAG_FOUND
-- Performing Test WUNDEF_C_FLAG_FOUND - Success
-- Performing Test WUNDEF_CXX_FLAG_FOUND
-- Performing Test WUNDEF_CXX_FLAG_FOUND - Success
-- Performing Test WFLOAT_EQUAL_C_FLAG_FOUND
-- Performing Test WFLOAT_EQUAL_C_FLAG_FOUND - Success
-- Performing Test WFLOAT_EQUAL_CXX_FLAG_FOUND
-- Performing Test WFLOAT_EQUAL_CXX_FLAG_FOUND - Success
-- Performing Test WSHADOW_C_FLAG_FOUND
-- Performing Test WSHADOW_C_FLAG_FOUND - Success
-- Performing Test WSHADOW_CXX_FLAG_FOUND
-- Performing Test WSHADOW_CXX_FLAG_FOUND - Success
-- Performing Test WBAD_FUNCTION_CAST_C_FLAG_FOUND
-- Performing Test WBAD_FUNCTION_CAST_C_FLAG_FOUND - Success
-- Performing Test WBAD_FUNCTION_CAST_CXX_FLAG_FOUND
-- Performing Test WBAD_FUNCTION_CAST_CXX_FLAG_FOUND - Failed
-- Performing Test WDECLARATION_AFTER_STATEMENT_C_FLAG_FOUND
-- Performing Test WDECLARATION_AFTER_STATEMENT_C_FLAG_FOUND - Success
-- Performing Test WDECLARATION_AFTER_STATEMENT_CXX_FLAG_FOUND
-- Performing Test WDECLARATION_AFTER_STATEMENT_CXX_FLAG_FOUND - Failed
-- Performing Test WC___COMPAT_C_FLAG_FOUND
-- Performing Test WC___COMPAT_C_FLAG_FOUND - Success
-- Performing Test WINLINE_C_FLAG_FOUND
-- Performing Test WINLINE_C_FLAG_FOUND - Success
-- Performing Test WNO_INLINE_CXX_FLAG_FOUND
-- Performing Test WNO_INLINE_CXX_FLAG_FOUND - Success
-- Performing Test WNO_LONG_LONG_C_FLAG_FOUND
-- Performing Test WNO_LONG_LONG_C_FLAG_FOUND - Success
-- Performing Test WNO_LONG_LONG_CXX_FLAG_FOUND
-- Performing Test WNO_LONG_LONG_CXX_FLAG_FOUND - Success
-- Performing Test WNO_VARIADIC_MACROS_C_FLAG_FOUND
-- Performing Test WNO_VARIADIC_MACROS_C_FLAG_FOUND - Success
-- Performing Test WNO_VARIADIC_MACROS_CXX_FLAG_FOUND
-- Performing Test WNO_VARIADIC_MACROS_CXX_FLAG_FOUND - Success
-- Performing Test WDOCUMENTATION_C_FLAG_FOUND
-- Performing Test WDOCUMENTATION_C_FLAG_FOUND - Failed
-- Performing Test WDOCUMENTATION_CXX_FLAG_FOUND
-- Performing Test WDOCUMENTATION_CXX_FLAG_FOUND - Failed
-- Performing Test WNO_C11_EXTENSIONS_C_FLAG_FOUND
-- Performing Test WNO_C11_EXTENSIONS_C_FLAG_FOUND - Success
-- Performing Test WNO_C11_EXTENSIONS_CXX_FLAG_FOUND
-- Performing Test WNO_C11_EXTENSIONS_CXX_FLAG_FOUND - Success
-- Performing Test WERROR_CXX_FLAG_FOUND
-- Performing Test WERROR_CXX_FLAG_FOUND - Success
-- Performing Test HAVE_C_WUNUSED_CONST_VARIABLE
-- Performing Test HAVE_C_WUNUSED_CONST_VARIABLE - Failed
***********************************************************
*             Stage 4 of 9 - Check for Libraries          *
***********************************************************
-- Looking for pthread.h
-- Looking for pthread.h - found
-- Looking for pthread_create
-- Looking for pthread_create - not found
-- Looking for pthread_create in pthreads
-- Looking for pthread_create in pthreads - not found
-- Looking for pthread_create in pthread
-- Looking for pthread_create in pthread - not found
-- Check if compiler accepts -pthread
-- Check if compiler accepts -pthread - no
-- Could NOT find Threads (missing:  Threads_FOUND) 
-- Performing Test STL_LIB_TEST
-- Performing Test STL_LIB_TEST - Success
-- Looking for daemon in bsd
-- Looking for daemon in bsd - found
-- Looking for cos in m
-- Looking for cos in m - not found
-- Looking for uuid_generate in uuid
-- Looking for uuid_generate in uuid - not found
-- Looking for socket in socket
-- Looking for socket in socket - not found
-- Looking for gethostbyaddr in nsl
-- Looking for gethostbyaddr in nsl - not found
-- Looking for socket in network
-- Looking for socket in network - found
-- Looking for mallopt in c
-- Looking for mallopt in c - not found
-- Looking for mallopt in malloc
-- Looking for mallopt in malloc - not found
-- Looking for dlopen in dl
-- Looking for dlopen in dl - not found
-- Looking for yyless in l
-- Looking for yyless in l - not found
-- Performing Test HAVE_TIMESETEVENT
-- Performing Test HAVE_TIMESETEVENT - Failed
***********************************************************
*               Stage 5 of 9 - Check for Headers          *
***********************************************************
-- Performing Test WORKING_SYS_WAIT
-- Performing Test WORKING_SYS_WAIT - Success
-- Looking for include file dirent.h
-- Looking for include file dirent.h - found
-- Looking for include file arpa/inet.h
-- Looking for include file arpa/inet.h - found
-- Looking for include file curses.h
-- Looking for include file curses.h - not found
-- Looking for include file direct.h
-- Looking for include file direct.h - not found
-- Looking for include file dlfcn.h
-- Looking for include file dlfcn.h - found
-- Looking for include file dslib.h
-- Looking for include file dslib.h - not found
-- Looking for include file emmintrin.h
-- Looking for include file emmintrin.h - found
-- Looking for include file getopt.h
-- Looking for include file getopt.h - found
-- Looking for include file gl/device.h
-- Looking for include file gl/device.h - not found
-- Looking for include file gl/glext.h
-- Looking for include file gl/glext.h - not found
-- Looking for include file gl/wglext.h
-- Looking for include file gl/wglext.h - not found
-- Looking for include file grp.h
-- Looking for include file grp.h - found
-- Looking for include file inttypes.h
-- Looking for include file inttypes.h - found
-- Looking for include file io.h
-- Looking for include file io.h - not found
-- Looking for include file libgen.h
-- Looking for include file libgen.h - found
-- Looking for include file mach/thread_policy.h
-- Looking for include file mach/thread_policy.h - not found
-- Looking for include file memory.h
-- Looking for include file memory.h - found
-- Looking for include file ncurses.h
-- Looking for include file ncurses.h - not found
-- Looking for include file netdb.h
-- Looking for include file netdb.h - found
-- Looking for include file netinet/in.h
-- Looking for include file netinet/in.h - found
-- Looking for include file poll.h
-- Looking for include file poll.h - found
-- Looking for include file process.h
-- Looking for include file process.h - not found
-- Looking for include file pthread.h
-- Looking for include file pthread.h - found
-- Looking for include file pthread_np.h
-- Looking for include file pthread_np.h - not found
-- Looking for include file pwd.h
-- Looking for include file pwd.h - found
-- Looking for include file rle.h
-- Looking for include file rle.h - not found
-- Looking for include file sched.h
-- Looking for include file sched.h - found
-- Looking for include file sgtty.h
-- Looking for include file sgtty.h - not found
-- Looking for include file signal.h
-- Looking for include file signal.h - found
-- Looking for include file stdlib.h
-- Looking for include file stdlib.h - found
-- Looking for include file string.h
-- Looking for include file string.h - found
-- Looking for include file strings.h
-- Looking for include file strings.h - found
-- Looking for include file strsafe.h
-- Looking for include file strsafe.h - not found
-- Looking for include file sys/_ioctl.h
-- Looking for include file sys/_ioctl.h - not found
-- Looking for include file sys/cpuset.h
-- Looking for include file sys/cpuset.h - not found
-- Looking for include file sys/file.h
-- Looking for include file sys/file.h - found
-- Looking for include file sys/ioctl.h
-- Looking for include file sys/ioctl.h - found
-- Looking for include file sys/ioctl_compat.h
-- Looking for include file sys/ioctl_compat.h - not found
-- Looking for include file sys/ipc.h
-- Looking for include file sys/ipc.h - found
-- Looking for include file sys/machd.h
-- Looking for include file sys/machd.h - not found
-- Looking for include file sys/mman.h
-- Looking for include file sys/mman.h - found
-- Looking for include file sys/mount.h
-- Looking for include file sys/mount.h - not found
-- Looking for include file sys/param.h
-- Looking for include file sys/param.h - found
-- Looking for include file sys/prctl.h
-- Looking for include file sys/prctl.h - not found
-- Looking for include file sys/resource.h
-- Looking for include file sys/resource.h - found
-- Looking for include file sys/sched.h
-- Looking for include file sys/sched.h - not found
-- Looking for include file sys/select.h
-- Looking for include file sys/select.h - found
-- Looking for include file sys/shm.h
-- Looking for include file sys/shm.h - not found
-- Looking for include file sys/socket.h
-- Looking for include file sys/socket.h - found
-- Looking for include file sys/stat.h
-- Looking for include file sys/stat.h - found
-- Looking for include file sys/sysctl.h
-- Looking for include file sys/sysctl.h - not found
-- Looking for include file sys/sysinfo.h
-- Looking for include file sys/sysinfo.h - not found
-- Looking for include file sys/sysmp.h
-- Looking for include file sys/sysmp.h - not found
-- Looking for include file sys/time.h
-- Looking for include file sys/time.h - found
-- Looking for include file sys/times.h
-- Looking for include file sys/times.h - found
-- Looking for include file sys/un.h
-- Looking for include file sys/un.h - found
-- Looking for include file sys/wait.h
-- Looking for include file sys/wait.h - found
-- Looking for include file syslog.h
-- Looking for include file syslog.h - found
-- Looking for include file term.h
-- Looking for include file term.h - not found
-- Looking for include file termcap.h
-- Looking for include file termcap.h - not found
-- Looking for include file terminfo.h
-- Looking for include file terminfo.h - not found
-- Looking for include file termio.h
-- Looking for include file termio.h - not found
-- Looking for include file termios.h
-- Looking for include file termios.h - found
-- Looking for include file termlib.h
-- Looking for include file termlib.h - not found
-- Looking for include file tinfo.h
-- Looking for include file tinfo.h - not found
-- Looking for include file ulocks.h
-- Looking for include file ulocks.h - not found
-- Looking for include file unistd.h
-- Looking for include file unistd.h - found
-- Looking for include file uuid/uuid.h
-- Looking for include file uuid/uuid.h - not found
-- Looking for include file windows.h
-- Looking for include file windows.h - not found
-- Looking for C++ include istream
-- Looking for C++ include istream - found
-- Looking for C++ include limits
-- Looking for C++ include limits - found
-- Performing Test HAVE_BASENAME
-- Performing Test HAVE_BASENAME - Success
-- Performing Test HAVE_DIRNAME
-- Performing Test HAVE_DIRNAME - Success
-- Performing Test HAVE_EMMINTRIN
-- Performing Test HAVE_EMMINTRIN - Success
***********************************************************
*          Stage 6 of 9 - Check for Types/Structures      *
***********************************************************
-- Performing Test HAVE_STRUCT_STAT_ST_BLKSIZE
-- Performing Test HAVE_STRUCT_STAT_ST_BLKSIZE - Success
-- Performing Test HAVE_STRUCT_STAT_ST_BLOCKS
-- Performing Test HAVE_STRUCT_STAT_ST_BLOCKS - Success
-- Performing Test HAVE_STRUCT_STAT_ST_RDEV
-- Performing Test HAVE_STRUCT_STAT_ST_RDEV - Success
-- Check size of socklen_t
-- Check size of socklen_t - failed
-- Check size of socklen_t
-- Check size of socklen_t - failed
-- Check size of socklen_t
-- Check size of socklen_t - done
-- Check size of cpu_set_t
-- Check size of cpu_set_t - failed
-- Check size of int
-- Check size of int - done
-- Check size of long
-- Check size of long - done
-- Check size of long long
-- Check size of long long - done
-- Check size of off_t
-- Check size of off_t - done
-- Check size of ptrdiff_t
-- Check size of ptrdiff_t - done
-- Check size of size_t
-- Check size of size_t - done
-- Check size of ssize_t
-- Check size of ssize_t - done
-- Check size of uint64_t
-- Check size of uint64_t - done
-- Check size of uintptr_t
-- Check size of uintptr_t - done
-- Check size of sig_t
-- Check size of sig_t - failed
-- Performing Test HAVE_THREAD_LOCAL
-- Performing Test HAVE_THREAD_LOCAL - Failed
-- Performing Test HAVE___THREAD
-- Performing Test HAVE___THREAD - Success
-- Performing Test HAVE_C99_FORMAT_SPECIFIERS
-- Performing Test HAVE_C99_FORMAT_SPECIFIERS - Success
-- Performing Test HAVE_STATIC_ARRAYS
-- Performing Test HAVE_STATIC_ARRAYS - Failed
***********************************************************
*              Stage 7 of 9 - Check for Functions         *
***********************************************************
-- Performing Test WORKING_ALLOCA
-- Performing Test WORKING_ALLOCA - Success
-- Looking for XQueryExtension
-- Looking for XQueryExtension - not found
-- Looking for _putenv_s
-- Looking for _putenv_s - not found
-- Looking for alarm
-- Looking for alarm - found
-- Looking for dlopen
-- Looking for dlopen - found
-- Looking for drand48
-- Looking for drand48 - found
-- Looking for fchmod
-- Looking for fchmod - found
-- Looking for fsync
-- Looking for fsync - found
-- Looking for getcwd
-- Looking for getcwd - found
-- Looking for getegid
-- Looking for getegid - found
-- Looking for getenv_s
-- Looking for getenv_s - not found
-- Looking for geteuid
-- Looking for geteuid - found
-- Looking for gethostname
-- Looking for gethostname - found
-- Looking for getloadavg
-- Looking for getloadavg - not found
-- Looking for getopt_long
-- Looking for getopt_long - found
-- Looking for getprogname
-- Looking for getprogname - not found
-- Looking for htonll
-- Looking for htonll - not found
-- Looking for logb
-- Looking for logb - found
-- Looking for lrand48
-- Looking for lrand48 - found
-- Looking for mkstemp
-- Looking for mkstemp - found
-- Looking for ntohll
-- Looking for ntohll - not found
-- Looking for pipe
-- Looking for pipe - found
-- Looking for popen
-- Looking for popen - found
-- Looking for posix_memalign
-- Looking for posix_memalign - found
-- Looking for random
-- Looking for random - found
-- Looking for realpath
-- Looking for realpath - found
-- Looking for setenv
-- Looking for setenv - found
-- Looking for setpgid
-- Looking for setpgid - found
-- Looking for setpriority
-- Looking for setpriority - not found
-- Looking for shmat
-- Looking for shmat - not found
-- Looking for shmctl
-- Looking for shmctl - not found
-- Looking for shmdt
-- Looking for shmdt - not found
-- Looking for shmget
-- Looking for shmget - not found
-- Looking for srand48
-- Looking for srand48 - found
-- Looking for strcasecmp
-- Looking for strcasecmp - found
-- Looking for strdup
-- Looking for strdup - found
-- Looking for strlcat
-- Looking for strlcat - found
-- Looking for strlcpy
-- Looking for strlcpy - found
-- Looking for strncasecmp
-- Looking for strncasecmp - found
-- Looking for sync
-- Looking for sync - found
-- Looking for sysconf
-- Looking for sysconf - found
-- Looking for sysctl
-- Looking for sysctl - not found
-- Looking for sysmp
-- Looking for sysmp - not found
-- Looking for vfork
-- Looking for vfork - found
-- Looking for vsscanf
-- Looking for vsscanf - found
-- Looking for writev
-- Looking for writev - found
-- Looking for daemon
-- Looking for daemon - not found
-- Looking for ntohll
-- Looking for ntohll - not found
-- Looking for htonll
-- Looking for htonll - not found
-- Looking for kill
-- Looking for kill - found
-- Performing Test HAVE_DECL_KILL
-- Performing Test HAVE_DECL_KILL - Success
-- Looking for fileno
-- Looking for fileno - found
-- Performing Test HAVE_DECL_FILENO
-- Performing Test HAVE_DECL_FILENO - Success
-- Looking for snprintf
-- Looking for snprintf - found
-- Performing Test HAVE_GETFULLPATHNAME
-- Performing Test HAVE_GETFULLPATHNAME - Failed
-- Performing Test HAVE_PROGRAM_INVOCATION_NAME
-- Performing Test HAVE_PROGRAM_INVOCATION_NAME - Failed
-- Looking for lrint
-- Looking for lrint - found
-- Performing Test HAVE_LRINT_lrint_test_COMPILE
-- Performing Test HAVE_LRINT_lrint_test_COMPILE - Success
-- Performing Test HAVE_LRINT_lrint_test_negative_COMPILE
-- Performing Test HAVE_LRINT_lrint_test_negative_COMPILE - Success
-- Performing Test HAVE_DECL_LRINT
-- Performing Test HAVE_DECL_LRINT - Success
-- Looking for tgamma
-- Looking for tgamma - found
-- Performing Test HAVE_TGAMMA_tgamma_test_COMPILE
-- Performing Test HAVE_TGAMMA_tgamma_test_COMPILE - Failed
***********************************************************
*          Stage 8 of 9 - Check for System Services       *
***********************************************************
-- Performing Test W__C_FLAG_FOUND
-- Performing Test W__C_FLAG_FOUND - Failed
-- Performing Test W__CXX_FLAG_FOUND
-- Performing Test W__CXX_FLAG_FOUND - Failed
-- Performing Test W0_C_FLAG_FOUND
-- Performing Test W0_C_FLAG_FOUND - Failed
-- Performing Test W0_CXX_FLAG_FOUND
-- Performing Test W0_CXX_FLAG_FOUND - Failed
-- Performing Test W_C_FLAG_FOUND
-- Performing Test W_C_FLAG_FOUND - Success
-- Performing Test W_CXX_FLAG_FOUND
-- Performing Test W_CXX_FLAG_FOUND - Success
-- Could NOT find LEMON (missing:  LEMON_EXECUTABLE LEMON_TEMPLATE) 
-- Found LEMON: /boot/home/brlcad/build/bin/lemon  
-- Could NOT find RE2C (missing:  RE2C_EXECUTABLE) 
-- Looking for stdbool.h
-- Looking for stdbool.h - found
-- Looking for memset
-- Looking for memset - found
-- Looking for mmap
-- Looking for mmap - found
-- Looking for munmap
-- Looking for munmap - found
-- Looking for strndup
-- Looking for strndup - found
-- Check size of char
-- Check size of char - done
-- Check size of int
-- Check size of int - done
-- Check size of long
-- Check size of long - done
-- Check size of short
-- Check size of short - done
-- Found RE2C: /boot/home/brlcad/build/bin/re2c  
-- Found PERPLEX: /boot/home/brlcad/build/bin/perplex  
-- Could NOT find ASTYLE (missing:  ASTYLE_EXECUTABLE) 
-- Could NOT find XSLTPROC (missing:  XSLTPROC_EXECUTABLE) 
-- Looking for time.h
-- Looking for time.h - found
-- Looking for stdarg.h
-- Looking for stdarg.h - found
-- Could NOT find Threads (missing:  Threads_FOUND) 
-- Looking for ansidecl.h
-- Looking for ansidecl.h - not found
-- Looking for arpa/nameser.h
-- Looking for arpa/nameser.h - found
-- Looking for ctype.h
-- Looking for ctype.h - found
-- Looking for dl.h
-- Looking for dl.h - not found
-- Looking for errno.h
-- Looking for errno.h - found
-- Looking for fcntl.h
-- Looking for fcntl.h - found
-- Looking for float.h
-- Looking for float.h - found
-- Looking for fp_class.h
-- Looking for fp_class.h - not found
-- Looking for ieeefp.h
-- Looking for ieeefp.h - not found
-- Looking for inttypes.h.h
-- Looking for inttypes.h.h - not found
-- Looking for limits.h
-- Looking for limits.h - found
-- Looking for malloc.h
-- Looking for malloc.h - found
-- Looking for math.h
-- Looking for math.h - found
-- Looking for nan.h
-- Looking for nan.h - not found
-- Looking for ndir.h
-- Looking for ndir.h - not found
-- Looking for resolv.h
-- Looking for resolv.h - found
-- Looking for sys/ndir.h
-- Looking for sys/ndir.h - not found
-- Looking for sys/timeb.h
-- Looking for sys/timeb.h - found
-- Looking for finite
-- Looking for finite - found
-- Looking for printf
-- Looking for printf - found
-- Looking for fprintf
-- Looking for fprintf - found
-- Looking for sprintf
-- Looking for sprintf - found
-- Looking for vfprintf
-- Looking for vfprintf - found
-- Looking for vsnprintf
-- Looking for vsnprintf - found
-- Looking for vsprintf
-- Looking for vsprintf - found
-- Looking for ftime
-- Looking for ftime - found
-- Looking for getaddrinfo
-- Looking for getaddrinfo - not found
-- Looking for gettimeofday
-- Looking for gettimeofday - found
-- Looking for isinf
-- Looking for isinf - found
-- Looking for isnan
-- Looking for isnan - found
-- Looking for localtime
-- Looking for localtime - found
-- Looking for signal
-- Looking for signal - found
-- Looking for sscanf
-- Looking for sscanf - found
-- Looking for stat
-- Looking for stat - found
-- Looking for strerror
-- Looking for strerror - found
-- Looking for strftime
-- Looking for strftime - found
-- Performing Test HAVE_VA_COPY
-- Performing Test HAVE_VA_COPY - Success
-- Looking for __va_copy
-- Looking for __va_copy - not found
-- Looking for dlopen in dl
-- Looking for dlopen in dl - not found
-- Looking for dlopen in c
-- Looking for dlopen in c - not found
-- Looking for pow in m
-- Looking for pow in m - not found
-- Could NOT find Threads (missing:  Threads_FOUND) 
-- Looking for locale.h
-- Looking for locale.h - found
-- Looking for xlocale.h
-- Looking for xlocale.h - not found
-- Looking for asctime
-- Looking for asctime - found
-- Looking for clock_gettime
-- Looking for clock_gettime - found
-- Looking for gmtime_r
-- Looking for gmtime_r - found
-- Looking for localtime_r
-- Looking for localtime_r - found
-- Looking for mktime
-- Looking for mktime - found
-- Looking for time
-- Looking for time - found
-- Found XMLLINT: /bin/xmllint  
-- Looking for regcomp in c
-- Looking for regcomp in c - not found
-- Could NOT find REGEX (missing:  REGEX_LIBRARY) 
-- Looking for include file regex.h
-- Looking for include file regex.h - found
-- Looking for regcomp in c
-- Looking for regcomp in c - not found
-- Found ZLIB: /boot/system/develop/headers/x86  
-- Could NOT find TINYCTHREAD (missing:  TINYCTHREAD_LIBRARY TINYCTHREAD_INCLUDE_DIR) 
-- Found Freetype: /boot/system/develop/lib/x86/libfreetype.so (found version "2.6.3") 
-- Looking for tputs in termlib
-- Looking for tputs in termlib - not found
-- Looking for tputs in ncurses
-- Looking for tputs in ncurses - not found
-- Looking for tputs in curses
-- Looking for tputs in curses - not found
-- Looking for tputs in termcap
-- Looking for tputs in termcap - not found
-- Looking for tputs in terminfo
-- Looking for tputs in terminfo - not found
-- Looking for tputs in tinfo
-- Looking for tputs in tinfo - not found
-- Looking for tputs in ccurses
-- Looking for tputs in ccurses - not found
-- Performing Test LIBTERM_RESULT
-- Performing Test LIBTERM_RESULT - Failed
-- Could NOT find TERMLIB (missing:  TERMLIB_LIBRARY TERMLIB_INCLUDE_DIR) 
-- Could NOT find NETPBM (missing:  NETPBM_LIBRARY NETPBM_INCLUDE_DIR) 
-- Check size of int64_t
-- Check size of int64_t - done
-- Check size of long
-- Check size of long - done
-- Check size of int
-- Check size of int - done
-- Found ZLIB: /boot/system/develop/lib/x86/libz.so (found version "1.2.8") 
-- Found PNG: /boot/system/develop/lib/x86/libpng.so (found version "1.6.20") 
-- Could NOT find TCL (missing:  TCL_LIBRARY TCL_TCLSH_EXECUTABLE TCL_TCLSH TCL_LIBRARIES TCL_INCLUDE_DIRS TCL_CONF_PREFIX TCL_LIBRARY TCL_INCLUDE_PATH TCL_STUB_LIBRARIES TCL_STUB_LIBRARY TK_INCLUDE_PATH TCL_TK_CONF_PREFIX TCL_TK_LIBRARY TCL_WISH_EXECUTABLE TK_LIBRARY TCL_TK_STUB_LIBRARY TK_STUB_LIBRARY) 
-- Could NOT find TK (missing:  TCL_TK_LIBRARY TCL_TCLSH_EXECUTABLE TCL_TCLSH TCL_LIBRARIES TCL_INCLUDE_DIRS TCL_CONF_PREFIX TCL_LIBRARY TCL_INCLUDE_PATH TCL_STUB_LIBRARIES TCL_STUB_LIBRARY TK_INCLUDE_PATH TCL_TK_CONF_PREFIX TCL_TK_LIBRARY TCL_WISH_EXECUTABLE TK_LIBRARY TCL_TK_STUB_LIBRARY TK_STUB_LIBRARY TCL_LIBRARY) 
-- Looking for sys/filio.h
-- Looking for sys/filio.h - not found
-- Performing Test FLOAT_H_USABLE
-- Performing Test FLOAT_H_USABLE - Success
-- Looking for values.h
-- Looking for values.h - not found
-- Performing Test LIMITS_H_USABLE
-- Performing Test LIMITS_H_USABLE - Success
-- Performing Test SYS_WAIT_H_USABLE
-- Performing Test SYS_WAIT_H_USABLE - Success
-- Performing Test DLFCN_H_USABLE
-- Performing Test DLFCN_H_USABLE - Success
-- Performing Test SYS_PARAM_H_USABLE
-- Performing Test SYS_PARAM_H_USABLE - Success
-- Performing Test PIPE_COMPILER_FLAG
-- Performing Test PIPE_COMPILER_FLAG - Success
-- Could NOT find Threads (missing:  Threads_FOUND) 
-- Looking for cos in m
-- Looking for cos in m - not found
-- Looking for ieee_flags in sunmath
-- Looking for ieee_flags in sunmath - not found
-- Looking for INET library
-- Found INET library: inet
-- Looking for net/errno.h
-- Looking for net/errno.h - not found
-- Looking for connect
-- Looking for connect - not found
-- Looking for setsockopt
-- Looking for setsockopt - not found
-- Looking for connect in socket
-- Looking for connect in socket - not found
-- Looking for gethostbyname
-- Looking for gethostbyname - not found
-- Looking for gethostbyname in nsl
-- Looking for gethostbyname in nsl - not found
-- Looking for dlopen in dl
-- Looking for dlopen in dl - not found
-- Check if the system is big endian
-- Searching 16 bit integer
-- Check size of unsigned short
-- Check size of unsigned short - done
-- Using unsigned short
-- Check if the system is big endian - little endian
-- Looking for hypot
-- Looking for hypot - found
-- Looking for opendir
-- Looking for opendir - found
-- Looking for strtol
-- Looking for strtol - found
-- Looking for waitpid
-- Looking for waitpid - found
-- Looking for wait3
-- Looking for wait3 - not found
-- Looking for uname
-- Looking for uname - found
-- Performing Test HAVE_TERMIOS
-- Performing Test HAVE_TERMIOS - Success
-- Performing Test SYS_TIME_H_USABLE
-- Performing Test SYS_TIME_H_USABLE - Success
-- Performing Test HAVE_STRUCT_TM_TM_ZONE
-- Performing Test HAVE_STRUCT_TM_TM_ZONE - Success
-- Performing Test HAVE_TM_TZADJ
-- Performing Test HAVE_TM_TZADJ - Failed
-- Performing Test HAVE_TM_GMTOFF
-- Performing Test HAVE_TM_GMTOFF - Success
-- Performing Test HAVE_TIMEZONE_VAR
-- Performing Test HAVE_TIMEZONE_VAR - Success
-- Performing Test TIME_WITH_SYS_TIME_WORKS
-- Performing Test TIME_WITH_SYS_TIME_WORKS - Success
-- Performing Test HAVE_STRUCT_HAS_ST_BLOCKS
-- Performing Test HAVE_STRUCT_HAS_ST_BLOCKS - Success
-- Performing Test HAVE_STRUCT_HAS_ST_BLKSIZE
-- Performing Test HAVE_STRUCT_HAS_ST_BLKSIZE - Success
-- Check size of blkcnt_t
-- Check size of blkcnt_t - done
-- Looking for fstatfs,
-- Looking for fstatfs, - not found
-- Looking for memcmp
-- Looking for memcmp - found
-- Looking for strstr
-- Looking for strstr - found
-- Performing Test WORKING_strstr
-- Performing Test WORKING_strstr - Success
-- Looking for strtoul
-- Looking for strtoul - found
-- Performing Test WORKING_strtoul
-- Performing Test WORKING_strtoul - Success
-- Looking for strtod
-- Looking for strtod - found
-- Performing Test WORKING_strtod
-- Performing Test WORKING_strtod - Success
-- Check size of mode_t
-- Check size of mode_t - done
-- Check size of pid_t
-- Check size of pid_t - done
-- Check size of uid_t
-- Check size of uid_t - done
-- Check size of intptr_t
-- Check size of intptr_t - done
-- Performing Test HAVE_UNION_WAIT
-- Performing Test HAVE_UNION_WAIT - Failed
-- Looking for BSDgettimeofday
-- Looking for BSDgettimeofday - not found
-- Looking for gettimeofday
-- Looking for gettimeofday - found
-- Performing Test CHAR_IS_UNSIGNED
-- Performing Test CHAR_IS_UNSIGNED - Success
-- Performing Test HAVE_SIGNED_CHAR
-- Performing Test HAVE_SIGNED_CHAR - Success
-- Looking for langinfo.h
-- Looking for langinfo.h - found
-- Performing Test LANGINFO_COMPILES
-- Performing Test LANGINFO_COMPILES - Success
-- Looking for chflags
-- Looking for chflags - not found
-- Looking for mkstemps
-- Looking for mkstemps - not found
-- Performing Test USABLE_ISNAN
-- Performing Test USABLE_ISNAN - Success
-- Performing Test FTS_WORKING
-- Performing Test FTS_WORKING - Success
-- Could NOT find TIMEZONE (missing:  TIMEZONE_DATA_DIR) 
-- Performing Test STACK_GROWS_UP
-- Performing Test STACK_GROWS_UP - Failed
-- Looking for sys/fstatfs.h
-- Looking for sys/fstatfs.h - not found
-- Looking for AvailabilityMacros.h
-- Looking for AvailabilityMacros.h - not found
-- Performing Test COMPILER_SUPPORTS_HIDDEN
-- Performing Test COMPILER_SUPPORTS_HIDDEN - Success
-- Looking for sys/modem.h
-- Looking for sys/modem.h - not found
-- Performing Test FD_SET_IN_TYPES_H
-- Performing Test FD_SET_IN_TYPES_H - Failed
-- Performing Test FPIC_COMPILER_FLAG
-- Performing Test FPIC_COMPILER_FLAG - Success
-- Looking for sysent.h
-- Looking for sysent.h - not found
-- Looking for abs
-- Looking for abs - found
-- Looking for memcpy
-- Looking for memcpy - found
-- Looking for memmove
-- Looking for memmove - found
-- Looking for getopt
-- Looking for getopt - found
-- Performing Test HAVE_STD_THREAD
-- Performing Test HAVE_STD_THREAD - Failed
-- Could NOT find ADAPTAGRAMS (missing:  AVOID_LIBRARY AVOID_INCLUDE_DIR) 
***********************************************************
*        Stage 9 of 9 - Define BRL-CAD Build Targets      *
***********************************************************
-- Adding src...
-- Adding src/libbu...
--- Checking operating system support for file symlinking
--- Checking operating system support for file symlinking - Supported
-- Adding src/libbu - done
-- Adding src/libbn...
-- Adding src/libbn - done
-- Adding src/libbg...
-- Adding src/libbg - done
-- Adding src/libbrep...
-- Performing Test NOERROR_FLAG_CXX
-- Performing Test NOERROR_FLAG_CXX - Success
-- Adding src/libbrep - done
-- Adding src/librt...
-- Adding src/librt - done
-- Adding src/libwdb...
-- Adding src/libwdb - done
-- Adding src/libpkg...
-- Adding src/libpkg - done
-- Adding src/libfb...
-- Adding src/libfb - done
-- Adding src/libgcv...
-- Performing Test HAVE_UNIQUE_PTR
-- Performing Test HAVE_UNIQUE_PTR - Failed
-- Adding src/libgcv - done
-- Adding src/libanalyze...
-- Adding src/libanalyze - done
-- Adding src/libged...
-- Adding src/libged - done
-- Adding src/liboptical...
-- Adding src/liboptical - done
-- Adding src/libcursor...
-- Adding src/libcursor - done
-- Adding src/libdm...
-- Adding src/libdm - done
-- Adding src/libfft...
-- Adding src/libfft - done
-- Adding src/libicv...
-- Adding src/libicv - done
-- Adding src/libmultispectral...
-- Adding src/libmultispectral - done
-- Adding src/libpc...
-- Adding src/libpc - done
-- Adding src/libtclcad...
-- Adding src/libtclcad - done
-- Adding src/libtermio...
-- Adding src/libtermio - done
-- Adding src/anim...
-- Adding src/anim - done
-- Adding src/brlman...
-- Adding src/brlman - done
-- Adding src/burst...
-- Adding src/burst - done
-- Adding src/bwish...
-- Adding src/bwish - done
-- Adding src/conv...
-- Performing Test WD4065_CXX_FLAG_FOUND
-- Performing Test WD4065_CXX_FLAG_FOUND - Failed
-- Performing Test WD4251_CXX_FLAG_FOUND
-- Performing Test WD4251_CXX_FLAG_FOUND - Failed
-- Performing Test WD4800_CXX_FLAG_FOUND
-- Performing Test WD4800_CXX_FLAG_FOUND - Failed
-- Adding src/conv - done
-- Adding src/fb...
-- Adding src/fb - done
-- Adding src/fbed...
-- Adding src/fbed - done
-- Adding src/fbserv...
-- Adding src/fbserv - done
-- Adding src/gtools...
-- Adding src/gtools - done
-- Adding src/halftone...
-- Adding src/halftone - done
-- Adding src/irprep...
-- Adding src/irprep - done
-- Adding src/lgt...
-- Adding src/lgt - done
-- Adding src/nirt...
-- Adding src/nirt - done
-- Adding src/proc-db...
-- Adding src/proc-db - done
-- Adding src/rt...
-- Adding src/rt - done
-- Adding src/shapes...
-- Adding src/shapes - done
-- Adding src/sig...
-- Adding src/sig - done
-- Adding src/tab...
-- Adding src/tab - done
-- Adding src/util...
-- Adding src/util - done
-- Adding src/remrt...
-- Adding src/remrt - done
-- Adding src/rttherm...
-- Adding src/rttherm - done
-- Adding src/tclscripts...
-- Adding src/tclscripts - done
-- Adding src/adrt...
-- Adding src/adrt - done
-- Adding src/rtwizard...
-- Adding src/rtwizard - done
-- Adding src/archer...
-- Adding src/archer - done
-- Adding src/mged...
-- Adding src/mged - done
-- Adding src - done
-- Adding include...
-- Adding include - done
-- Adding sh...
-- Adding sh - done
-- Adding misc...
-- Adding misc - done
-- Adding doc...
-- Adding doc/docbook...
-- Adding doc/docbook - done
-- Adding doc/html...
-- Adding doc/html - done
-- Adding doc/legal...
-- Adding doc/legal - done
-- Adding doc - done
-- Adding db...
-- Adding db - done
-- Adding bench...
-- Adding bench - done
-- Adding regress...
-- Adding regress - done


-------------------- BRL-CAD Release 7.25.0, Build 20160529 --------------------

        Prefix: /usr/brlcad/dev-7.25.0
      Binaries: /usr/brlcad/dev-7.25.0/bin
     Libraries: /usr/brlcad/dev-7.25.0/lib
  Manual pages: /usr/brlcad/dev-7.25.0/share/man
Data resources: /usr/brlcad/dev-7.25.0/share
 
CC       = /bin/gcc-x86
CXX      = /bin/g++-x86
CFLAGS   = -pipe -fno-strict-aliasing -fno-common -fexceptions -std=gnu89 -g
           -ggdb3 -pedantic -pedantic-errors -Wall -Wextra -Wundef
           -Wfloat-equal -Wshadow -Wbad-function-cast
           -Wdeclaration-after-statement -Wc++-compat -Winline -Wno-long-long
           -Wno-variadic-macros -Wno-c11-extensions -Werror
CXXFLAGS = -pipe -fno-strict-aliasing -fno-common -fexceptions
           -ftemplate-depth-128 -std=gnu++98 -g -ggdb3 -pedantic -Wall -Wextra
           -Wundef -Wfloat-equal -Wshadow -Wno-inline -Wno-long-long
           -Wno-variadic-macros -Wno-c11-extensions -Werror
LDFLAGS  = -g -ggdb3
 
Compile Tcl ...........................: ON
Compile Tk ............................: OFF
Compile Itcl/Itk ......................: ON (Itcl only)
Compile Iwidgets ......................: OFF
Compile Tkhtml ........................: OFF
Compile tkpng .........................: OFF
Compile Tktable .......................: OFF
Compile libpng ........................: OFF
Compile libregex ......................: ON
Compile zlib ..........................: OFF
Compile termlib .......................: ON
Compile Utah Raster Toolkit ...........: ON
Compile openNURBS .....................: ON
Compile STEPcode.......................: ON
Compile Bullet ........................: OFF
 
OpenGL support (optional) .............: OFF
X11 support (optional) ................: OFF
Qt support (optional) .................: OFF
Enable run-time debugging (optional) ..: ON
 
Build 32/64-bit release ...............: 32BIT (Auto)
Build optimized release ...............: OFF
Build static libraries ................: OFF
Build dynamic libraries ...............: ON
Install example geometry models .......: ON
Generate extra docs ...................: ON (html/html/man)
 
Elapsed configuration time..: 3 minutes 5 seconds
-- Configuring done
-- Generating done
-- Build files have been written to: /boot/home/brlcad/build
~/brlcad/build> make

[ 16%] Building C object src/librt/CMakeFiles/librt.dir/timer42.c.o
/boot/home/brlcad/src/librt/timer42.c: In function 'prusage':
/boot/home/brlcad/src/librt/timer42.c:134:13: error: 'struct rusage' has no member named 'ru_nswap'
       i = r1->ru_nswap - r0->ru_nswap;
             ^
/boot/home/brlcad/src/librt/timer42.c:134:28: error: 'struct rusage' has no member named 'ru_nswap'
       i = r1->ru_nswap - r0->ru_nswap;
                            ^
/boot/home/brlcad/src/librt/timer42.c:139:55: error: 'struct rusage' has no member named 'ru_ixrss'
       bu_vls_printf(vp, "%ld", (long)(t == 0 ? 0 : (r1->ru_ixrss-r0->ru_ixrss)/t));
                                                       ^
/boot/home/brlcad/src/librt/timer42.c:139:68: error: 'struct rusage' has no member named 'ru_ixrss'
       bu_vls_printf(vp, "%ld", (long)(t == 0 ? 0 : (r1->ru_ixrss-r0->ru_ixrss)/t));
                                                                    ^
/boot/home/brlcad/src/librt/timer42.c:143:55: error: 'struct rusage' has no member named 'ru_idrss'
       bu_vls_printf(vp, "%ld", (long)(t == 0 ? 0 : (r1->ru_idrss+r1->ru_isrss-(r0->ru_idrss+r0->ru_isrss))/t));
                                                       ^
/boot/home/brlcad/src/librt/timer42.c:143:68: error: 'struct rusage' has no member named 'ru_isrss'
       bu_vls_printf(vp, "%ld", (long)(t == 0 ? 0 : (r1->ru_idrss+r1->ru_isrss-(r0->ru_idrss+r0->ru_isrss))/t));
                                                                    ^
/boot/home/brlcad/src/librt/timer42.c:143:82: error: 'struct rusage' has no member named 'ru_idrss'
       bu_vls_printf(vp, "%ld", (long)(t == 0 ? 0 : (r1->ru_idrss+r1->ru_isrss-(r0->ru_idrss+r0->ru_isrss))/t));
                                                                                  ^
/boot/home/brlcad/src/librt/timer42.c:143:95: error: 'struct rusage' has no member named 'ru_isrss'
       bu_vls_printf(vp, "%ld", (long)(t == 0 ? 0 : (r1->ru_idrss+r1->ru_isrss-(r0->ru_idrss+r0->ru_isrss))/t));
                                                                                               ^
/boot/home/brlcad/src/librt/timer42.c:147:57: error: 'struct rusage' has no member named 'ru_ixrss'
       bu_vls_printf(vp, "%ld", (long)(t == 0 ? 0 :  ((r1->ru_ixrss+r1->ru_isrss+r1->ru_idrss) - (r0->ru_ixrss+r0->ru_idrss+r0->ru_isrss))/t));
                                                         ^
/boot/home/brlcad/src/librt/timer42.c:147:70: error: 'struct rusage' has no member named 'ru_isrss'
       bu_vls_printf(vp, "%ld", (long)(t == 0 ? 0 :  ((r1->ru_ixrss+r1->ru_isrss+r1->ru_idrss) - (r0->ru_ixrss+r0->ru_idrss+r0->ru_isrss))/t));
                                                                      ^
/boot/home/brlcad/src/librt/timer42.c:147:83: error: 'struct rusage' has no member named 'ru_idrss'
       bu_vls_printf(vp, "%ld", (long)(t == 0 ? 0 :  ((r1->ru_ixrss+r1->ru_isrss+r1->ru_idrss) - (r0->ru_ixrss+r0->ru_idrss+r0->ru_isrss))/t));
                                                                                   ^
/boot/home/brlcad/src/librt/timer42.c:147:100: error: 'struct rusage' has no member named 'ru_ixrss'
       bu_vls_printf(vp, "%ld", (long)(t == 0 ? 0 :  ((r1->ru_ixrss+r1->ru_isrss+r1->ru_idrss) - (r0->ru_ixrss+r0->ru_idrss+r0->ru_isrss))/t));
                                                                                                    ^
/boot/home/brlcad/src/librt/timer42.c:147:113: error: 'struct rusage' has no member named 'ru_idrss'
       bu_vls_printf(vp, "%ld", (long)(t == 0 ? 0 :  ((r1->ru_ixrss+r1->ru_isrss+r1->ru_idrss) - (r0->ru_ixrss+r0->ru_idrss+r0->ru_isrss))/t));
                                                                                                                 ^
/boot/home/brlcad/src/librt/timer42.c:147:126: error: 'struct rusage' has no member named 'ru_isrss'
       bu_vls_printf(vp, "%ld", (long)(t == 0 ? 0 :  ((r1->ru_ixrss+r1->ru_isrss+r1->ru_idrss) - (r0->ru_ixrss+r0->ru_idrss+r0->ru_isrss))/t));
                                                                                                                              ^
/boot/home/brlcad/src/librt/timer42.c:151:41: error: 'struct rusage' has no member named 'ru_maxrss'
       bu_vls_printf(vp, "%ld", (long)(r1->ru_maxrss/2));
                                         ^
/boot/home/brlcad/src/librt/timer42.c:155:41: error: 'struct rusage' has no member named 'ru_majflt'
       bu_vls_printf(vp, "%ld", (long)(r1->ru_majflt-r0->ru_majflt));
                                         ^
/boot/home/brlcad/src/librt/timer42.c:155:55: error: 'struct rusage' has no member named 'ru_majflt'
       bu_vls_printf(vp, "%ld", (long)(r1->ru_majflt-r0->ru_majflt));
                                                       ^
/boot/home/brlcad/src/librt/timer42.c:159:41: error: 'struct rusage' has no member named 'ru_minflt'
       bu_vls_printf(vp, "%ld", (long)(r1->ru_minflt-r0->ru_minflt));
                                         ^
/boot/home/brlcad/src/librt/timer42.c:159:55: error: 'struct rusage' has no member named 'ru_minflt'
       bu_vls_printf(vp, "%ld", (long)(r1->ru_minflt-r0->ru_minflt));
                                                       ^
/boot/home/brlcad/src/librt/timer42.c:163:41: error: 'struct rusage' has no member named 'ru_inblock'
       bu_vls_printf(vp, "%ld", (long)(r1->ru_inblock-r0->ru_inblock));
                                         ^
/boot/home/brlcad/src/librt/timer42.c:163:56: error: 'struct rusage' has no member named 'ru_inblock'
       bu_vls_printf(vp, "%ld", (long)(r1->ru_inblock-r0->ru_inblock));
                                                        ^
/boot/home/brlcad/src/librt/timer42.c:167:41: error: 'struct rusage' has no member named 'ru_oublock'
       bu_vls_printf(vp, "%ld", (long)(r1->ru_oublock-r0->ru_oublock));
                                         ^
/boot/home/brlcad/src/librt/timer42.c:167:56: error: 'struct rusage' has no member named 'ru_oublock'
       bu_vls_printf(vp, "%ld", (long)(r1->ru_oublock-r0->ru_oublock));
                                                        ^
/boot/home/brlcad/src/librt/timer42.c:170:45: error: 'struct rusage' has no member named 'ru_nvcsw'
       bu_vls_printf(vp, "%ld+%ld", (long)(r1->ru_nvcsw-r0->ru_nvcsw), (long)(r1->ru_nivcsw-r0->ru_nivcsw));
                                             ^
/boot/home/brlcad/src/librt/timer42.c:170:58: error: 'struct rusage' has no member named 'ru_nvcsw'
       bu_vls_printf(vp, "%ld+%ld", (long)(r1->ru_nvcsw-r0->ru_nvcsw), (long)(r1->ru_nivcsw-r0->ru_nivcsw));
                                                          ^
/boot/home/brlcad/src/librt/timer42.c:170:80: error: 'struct rusage' has no member named 'ru_nivcsw'
       bu_vls_printf(vp, "%ld+%ld", (long)(r1->ru_nvcsw-r0->ru_nvcsw), (long)(r1->ru_nivcsw-r0->ru_nivcsw));
                                                                                ^
/boot/home/brlcad/src/librt/timer42.c:170:94: error: 'struct rusage' has no member named 'ru_nivcsw'
       bu_vls_printf(vp, "%ld+%ld", (long)(r1->ru_nvcsw-r0->ru_nvcsw), (long)(r1->ru_nivcsw-r0->ru_nivcsw));
                                                                                              ^
/boot/home/brlcad/src/librt/timer42.c: At top level:
cc1: error: unrecognized command line option '-Wno-c11-extensions' [-Werror]
cc1: all warnings being treated as errors
src/librt/CMakeFiles/librt.dir/build.make:6086: recipe for target 'src/librt/CMakeFiles/librt.dir/timer42.c.o' failed
make[2]: *** [src/librt/CMakeFiles/librt.dir/timer42.c.o] Error 1
make[2]: Target 'src/librt/CMakeFiles/librt.dir/build' not remade because of errors.

[ 21%] Building C object misc/tools/xmltools/libxml/CMakeFiles/xml.dir/src/threads.c.o
/boot/home/brlcad/misc/tools/xmltools/libxml/src/threads.c: In function 'xmlGetGlobalState':
/boot/home/brlcad/misc/tools/xmltools/libxml/src/threads.c:666:33: error: 'xmlOnceInit' undeclared (first use in this function)
     pthread_once(&once_control, xmlOnceInit);
                                 ^
/boot/home/brlcad/misc/tools/xmltools/libxml/src/threads.c:666:33: note: each undeclared identifier is reported only once for each function it appears in
/boot/home/brlcad/misc/tools/xmltools/libxml/src/threads.c: In function 'xmlIsMainThread':
/boot/home/brlcad/misc/tools/xmltools/libxml/src/threads.c:804:33: error: 'xmlOnceInit' undeclared (first use in this function)
     pthread_once(&once_control, xmlOnceInit);
                                 ^
misc/tools/xmltools/libxml/CMakeFiles/xml.dir/build.make:566: recipe for target 'misc/tools/xmltools/libxml/CMakeFiles/xml.dir/src/threads.c.o' failed


[ 22%] Building C object src/libcursor/CMakeFiles/libcursor.dir/cursor.c.o
/boot/home/brlcad/src/libcursor/cursor.c: In function 'LoadTP':
/boot/home/brlcad/src/libcursor/cursor.c:161:9: error: implicit declaration of function 'ioctl' [-Werror=implicit-function-declaration]
     if (ioctl(fd_stdout, TIOCGWINSZ, &window) == 0
         ^
/boot/home/brlcad/src/libcursor/cursor.c: At top level:
cc1: error: unrecognized command line option '-Wno-c11-extensions' [-Werror]
cc1: all warnings being treated as errors
src/libcursor/CMakeFiles/libcursor.dir/build.make:62: recipe for target 'src/libcursor/CMakeFiles/libcursor.dir/cursor.c.o' failed

[ 25%] Linking C executable ../../bin/fbserv
CMakeFiles/fbserv.dir/fbserv.c.o: In function `is_socket':
/boot/home/brlcad/src/fbserv/fbserv.c:189: undefined reference to `getsockname'
CMakeFiles/fbserv.dir/fbserv.c.o: In function `setup_socket':
/boot/home/brlcad/src/fbserv/fbserv.c:216: undefined reference to `setsockopt'
/boot/home/brlcad/src/fbserv/fbserv.c:232: undefined reference to `setsockopt'
/boot/home/brlcad/src/fbserv/fbserv.c:235: undefined reference to `setsockopt'
collect2: error: ld returned 1 exit status
src/fbserv/CMakeFiles/fbserv.dir/build.make:125: recipe for target 'bin/fbserv' failed
make[2]: *** [bin/fbserv] Error 1