Difference between revisions of "OpenBSD Build Log"

(Stash the results of an OpenBSD BRL-CAD build attempt for later analysis (too long for paste.lisp.org))
(No difference)

Revision as of 12:56, 1 May 2016

This build has a few hand-edited fixes to file linking that let some libraries needing freetype build successfully (libtk, for example.) Others were not hand edited, as a solution does need to be found.

Script started on Sun May  1 08:41:44 2016
$ make -k

[  0%] Built target buildtimestart
[  0%] Built target printtimestamp

Build Time: Sun May  1 08:41:49 2016

[  0%] Built target timestamp
[  0%] Built target y2038
[  1%] Built target zlib
[  1%] Built target regex
[  3%] Built target libbu
[  3%] Built target tinycthread
[  6%] Built target openNURBS
[  7%] Built target libbn
[  7%] Built target libbg
[  7%] Built target p2t
[  7%] Built target libgdiam
[  7%] Built target libbrep
[  7%] Built target libvds
[ 13%] Built target librt
[ 13%] Built target libwdb
[ 14%] Built target pipetest
[ 14%] Built target brickwall
[ 14%] Built target dsel
[ 14%] Built target smod
[ 14%] Built target png16
[ 14%] Built target tkstub
[ 14%] Built target tclstub
[ 15%] Built target itcl
[ 18%] Built target tcl
[ 19%] Built target freetype
[ 22%] Built target tk
[ 22%] Built target itk
[ 22%] Built target test_bu_path_component
[ 22%] Built target test_bu_sscanf
[ 22%] Built target books_EN_IMAGES_cp
[ 22%] Built target schema-expand
[ 22%] Built target svg-dtd-expand
[ 23%] Built target xml
[ 24%] Built target xslt
[ 25%] Built target exslt
[ 25%] Built target xmllint
[ 25%] Built target fonts-dejavu-expand
[ 25%] Built target xsltproc
[ 25%] Built target xsl-expand
[ 25%] Built target fonts-stix-expand
[ 25%] Built target offo-2-expand
[ 25%] Built target docbook-docbook-books-en
[ 25%] Built target test_curve_intersect
[ 25%] Built target raydebug_tcl_cp
[ 25%] Built target clipper
[ 25%] Built target netpbm
[ 25%] Built target libanalyze
[ 25%] Built target libicv
[ 25%] Built target libpkg
[ 26%] Built target libfb
[ 26%] Built target libdm
[ 26%] �[32mBuilding C object src/libged/CMakeFiles/libged.dir/clone.c.o�[0m
cc1: warnings being treated as errors
/home/cyapp/brlcad-7.25.0/src/libged/clone.c: In function 'clone_get_name':
/home/cyapp/brlcad-7.25.0/src/libged/clone.c:228: warning: Array size (512) smaller than format string size (513) (arg 6)
*** Error 1 in target 'src/libged/CMakeFiles/libged.dir/clone.c.o', line 879 of src/libged/CMakeFiles/libged.dir/build.make: cd /home/cyapp/brlcad-7.25.0/build/src/libged && /usr/bin/cc  -DBRLCADBUILD=1 -DHAVE_CONFIG_H -DOBJ_BREP=1 -Dlibged_EXPORTS -I/home/cyapp/brlcad-7.25.0/build/include -I/home/cyapp/brlcad-7.25.0/include -isystem /home/cyapp/brlcad-7.25.0/build/src/other/tcl/include -isystem /home/cyapp/brlcad-7.25.0/build/src/other/openNURBS -isystem /home/cyapp/brlcad-7.25.0/build/src/other/libz -isystem /home/cyapp/brlcad-7.25.0/build/src/other/libpng -isystem /home/cyapp/brlcad-7.25.0/build/src/other/libregex -isystem /home/cyapp/brlcad-7.25.0/src/other/tcl/generic -isystem /home/cyapp/brlcad-7.25.0/src/other/tcl/libtommath -isystem /home/cyapp/brlcad-7.25.0/src/other/tcl/unix -isystem /home/cyapp/brlcad-7.25.0/src/other/tk/generic -isystem /home/cyapp/brlcad-7.25.0/src/other/openNURBS -isystem /home/cyapp/brlcad-7.25.0/src/other/libz -isystem /home/cyapp/brlcad-7.25.0/src/other/poly2tri -isystem /home/cyapp/brlcad-7.25.0/src/other/libpng -isystem /home/cyapp/brlcad-7.25.0/src/other/libregex -isystem /home/cyapp/brlcad-7.25.0/src/other/clipper -isystem /usr/X11R6/include  -pipe -fno-strict-aliasing -fno-common -fexceptions -std=gnu89 -m64 -g -ggdb3 -fstack-protector-all -pedantic -pedantic-errors -Wall -Wextra -Wundef -Wfloat-equal -Wshadow -Wbad-function-cast -Wdeclaration-after-statement -Wc++-compat -Winline -Wno-long-long -Wno-variadic-macros -Werror -fPIC   -o CMakeFiles/libged.dir/clone.c.o   -c /home/cyapp/brlcad-7.25.0/src/libged/clone.c (continuing)
[ 26%] �[32mBuilding C object src/libged/CMakeFiles/libged.dir/gqa.c.o�[0m
cc1: warnings being treated as errors
/home/cyapp/brlcad-7.25.0/src/libged/gqa.c: In function 'read_units_double':
/home/cyapp/brlcad-7.25.0/src/libged/gqa.c:416: warning: Array size (256) smaller than format string size (257) (arg 4)
*** Error 1 in target 'src/libged/CMakeFiles/libged.dir/gqa.c.o', line 2391 of src/libged/CMakeFiles/libged.dir/build.make: cd /home/cyapp/brlcad-7.25.0/build/src/libged && /usr/bin/cc  -DBRLCADBUILD=1 -DHAVE_CONFIG_H -DOBJ_BREP=1 -Dlibged_EXPORTS -I/home/cyapp/brlcad-7.25.0/build/include -I/home/cyapp/brlcad-7.25.0/include -isystem /home/cyapp/brlcad-7.25.0/build/src/other/tcl/include -isystem /home/cyapp/brlcad-7.25.0/build/src/other/openNURBS -isystem /home/cyapp/brlcad-7.25.0/build/src/other/libz -isystem /home/cyapp/brlcad-7.25.0/build/src/other/libpng -isystem /home/cyapp/brlcad-7.25.0/build/src/other/libregex -isystem /home/cyapp/brlcad-7.25.0/src/other/tcl/generic -isystem /home/cyapp/brlcad-7.25.0/src/other/tcl/libtommath -isystem /home/cyapp/brlcad-7.25.0/src/other/tcl/unix -isystem /home/cyapp/brlcad-7.25.0/src/other/tk/generic -isystem /home/cyapp/brlcad-7.25.0/src/other/openNURBS -isystem /home/cyapp/brlcad-7.25.0/src/other/libz -isystem /home/cyapp/brlcad-7.25.0/src/other/poly2tri -isystem /home/cyapp/brlcad-7.25.0/src/other/libpng -isystem /home/cyapp/brlcad-7.25.0/src/other/libregex -isystem /home/cyapp/brlcad-7.25.0/src/other/clipper -isystem /usr/X11R6/include  -pipe -fno-strict-aliasing -fno-common -fexceptions -std=gnu89 -m64 -g -ggdb3 -fstack-protector-all -pedantic -pedantic-errors -Wall -Wextra -Wundef -Wfloat-equal -Wshadow -Wbad-function-cast -Wdeclaration-after-statement -Wc++-compat -Winline -Wno-long-long -Wno-variadic-macros -Werror -fPIC   -o CMakeFiles/libged.dir/gqa.c.o   -c /home/cyapp/brlcad-7.25.0/src/libged/gqa.c (continuing)
[ 26%] �[32mBuilding C object src/libged/CMakeFiles/libged.dir/loadview.c.o�[0m
cc1: warnings being treated as errors
/home/cyapp/brlcad-7.25.0/src/libged/loadview.c: In function 'ged_loadview':
/home/cyapp/brlcad-7.25.0/src/libged/loadview.c:145: warning: Array size (512) smaller than format string size (513) (arg 3)
/home/cyapp/brlcad-7.25.0/src/libged/loadview.c:164: warning: Array size (2048) smaller than format string size (2049) (arg 3)
/home/cyapp/brlcad-7.25.0/src/libged/loadview.c:196: warning: Array size (10000) smaller than format string size (10001) (arg 3)
/home/cyapp/brlcad-7.25.0/src/libged/loadview.c:207: warning: Array size (10000) smaller than format string size (10001) (arg 3)
/home/cyapp/brlcad-7.25.0/src/libged/loadview.c:218: warning: Array size (10000) smaller than format string size (10001) (arg 3)
*** Error 1 in target 'src/libged/CMakeFiles/libged.dir/loadview.c.o', line 2991 of src/libged/CMakeFiles/libged.dir/build.make: cd /home/cyapp/brlcad-7.25.0/build/src/libged && /usr/bin/cc  -DBRLCADBUILD=1 -DHAVE_CONFIG_H -DOBJ_BREP=1 -Dlibged_EXPORTS -I/home/cyapp/brlcad-7.25.0/build/include -I/home/cyapp/brlcad-7.25.0/include -isystem /home/cyapp/brlcad-7.25.0/build/src/other/tcl/include -isystem /home/cyapp/brlcad-7.25.0/build/src/other/openNURBS -isystem /home/cyapp/brlcad-7.25.0/build/src/other/libz -isystem /home/cyapp/brlcad-7.25.0/build/src/other/libpng -isystem /home/cyapp/brlcad-7.25.0/build/src/other/libregex -isystem /home/cyapp/brlcad-7.25.0/src/other/tcl/generic -isystem /home/cyapp/brlcad-7.25.0/src/other/tcl/libtommath -isystem /home/cyapp/brlcad-7.25.0/src/other/tcl/unix -isystem /home/cyapp/brlcad-7.25.0/src/other/tk/generic -isystem /home/cyapp/brlcad-7.25.0/src/other/openNURBS -isystem /home/cyapp/brlcad-7.25.0/src/other/libz -isystem /home/cyapp/brlcad-7.25.0/src/other/poly2tri -isystem /home/cyapp/brlcad-7.25.0/src/other/libpng -isystem /home/cyapp/brlcad-7.25.0/src/other/libregex -isystem /home/cyapp/brlcad-7.25.0/src/other/clipper -isystem /usr/X11R6/include  -pipe -fno-strict-aliasing -fno-common -fexceptions -std=gnu89 -m64 -g -ggdb3 -fstack-protector-all -pedantic -pedantic-errors -Wall -Wextra -Wundef -Wfloat-equal -Wshadow -Wbad-function-cast -Wdeclaration-after-statement -Wc++-compat -Winline -Wno-long-long -Wno-variadic-macros -Werror -fPIC   -o CMakeFiles/libged.dir/loadview.c.o   -c /home/cyapp/brlcad-7.25.0/src/libged/loadview.c (continuing)
Build for lib/libged.so.20.0 aborted
Build for lib/libged.so aborted
Build for src/libged/CMakeFiles/libged.dir/build aborted
`src/libged/CMakeFiles/libged.dir/build' not remade because of errors.
[ 34%] Built target libged
make: don't know how to make lib/libged.so.20.0 (prerequisite of: lib/libtclcad.so.20.0)(continuing)
Build for lib/libtclcad.so.20.0 aborted
Build for lib/libtclcad.so aborted
Build for src/libtclcad/CMakeFiles/libtclcad.dir/build aborted
`src/libtclcad/CMakeFiles/libtclcad.dir/build' not remade because of errors.
[ 35%] Built target libtclcad
[ 35%] �[32mBuilding C object src/conv/asc/CMakeFiles/asc2g.dir/asc2g.c.o�[0m
cc1: warnings being treated as errors
/home/cyapp/brlcad-7.25.0/src/conv/asc/asc2g.c: In function 'botbld':
/home/cyapp/brlcad-7.25.0/src/conv/asc/asc2g.c:1215: warning: Array size (200) smaller than format string size (201) (arg 4)
/home/cyapp/brlcad-7.25.0/src/conv/asc/asc2g.c: In function 'particlebld':
/home/cyapp/brlcad-7.25.0/src/conv/asc/asc2g.c:1367: warning: Array size (200) smaller than format string size (201) (arg 4)
/home/cyapp/brlcad-7.25.0/src/conv/asc/asc2g.c: In function 'arbnbld':
/home/cyapp/brlcad-7.25.0/src/conv/asc/asc2g.c:1423: warning: Array size (200) smaller than format string size (201) (arg 3)
*** Error 1 in target 'src/conv/asc/CMakeFiles/asc2g.dir/asc2g.c.o', line 63 of src/conv/asc/CMakeFiles/asc2g.dir/build.make: cd /home/cyapp/brlcad-7.25.0/build/src/conv/asc && /usr/bin/cc  -DBRLCADBUILD=1 -DBRLCAD_DLL -DHAVE_CONFIG_H -DOBJ_BREP=1 -D_CONSOLE -I/home/cyapp/brlcad-7.25.0/build/include -I/home/cyapp/brlcad-7.25.0/include -isystem /home/cyapp/brlcad-7.25.0/build/src/other/tcl/include -isystem /home/cyapp/brlcad-7.25.0/build/src/other/openNURBS -isystem /home/cyapp/brlcad-7.25.0/build/src/other/libz -isystem /home/cyapp/brlcad-7.25.0/build/src/other/libregex -isystem /home/cyapp/brlcad-7.25.0/src/other/tcl/generic -isystem /home/cyapp/brlcad-7.25.0/src/other/tcl/libtommath -isystem /home/cyapp/brlcad-7.25.0/src/other/tcl/unix -isystem /home/cyapp/brlcad-7.25.0/src/other/tk/generic -isystem /home/cyapp/brlcad-7.25.0/src/other/openNURBS -isystem /home/cyapp/brlcad-7.25.0/src/other/libz -isystem /home/cyapp/brlcad-7.25.0/src/other/poly2tri -isystem /home/cyapp/brlcad-7.25.0/src/other/libregex -isystem /usr/X11R6/include  -pipe -fno-strict-aliasing -fno-common -fexceptions -std=gnu89 -m64 -g -ggdb3 -fstack-protector-all -pedantic -pedantic-errors -Wall -Wextra -Wundef -Wfloat-equal -Wshadow -Wbad-function-cast -Wdeclaration-after-statement -Wc++-compat -Winline -Wno-long-long -Wno-variadic-macros -Werror   -o CMakeFiles/asc2g.dir/asc2g.c.o   -c /home/cyapp/brlcad-7.25.0/src/conv/asc/asc2g.c (continuing)
make: don't know how to make lib/libtclcad.so.20.0(continuing)
make: don't know how to make lib/libged.so.20.0(continuing)
Build for bin/asc2g aborted
Build for src/conv/asc/CMakeFiles/asc2g.dir/build aborted
`src/conv/asc/CMakeFiles/asc2g.dir/build' not remade because of errors.
[ 35%] Built target asc2g
make: don't know how to make bin/asc2g (prerequisite of: share/db/ktank.g)(continuing)
Build for share/db/ktank.g aborted
Build for db/CMakeFiles/ktank.g aborted
Build for ktank.g aborted
Build for db/CMakeFiles/ktank.g.dir/build aborted
`db/CMakeFiles/ktank.g.dir/build' not remade because of errors.
[ 35%] Built target ktank.g
make: don't know how to make bin/asc2g (prerequisite of: share/db/pic.g)(continuing)
Build for share/db/pic.g aborted
Build for db/CMakeFiles/pic.g aborted
Build for pic.g aborted
Build for db/CMakeFiles/pic.g.dir/build aborted
`db/CMakeFiles/pic.g.dir/build' not remade because of errors.
[ 35%] Built target pic.g
make: don't know how to make bin/asc2g (prerequisite of: share/db/prim.g)(continuing)
Build for share/db/prim.g aborted
Build for db/CMakeFiles/prim.g aborted
Build for prim.g aborted
Build for db/CMakeFiles/prim.g.dir/build aborted
`db/CMakeFiles/prim.g.dir/build' not remade because of errors.
[ 35%] Built target prim.g
[ 35%] Built target gtransfer_c_cp
[ 35%] Built target libgcv
[ 35%] Built target clutter
[ 35%] Built target pdb-g
[ 35%] Built target tea_nmg
[ 35%] Built target rtwizard_TCLSCRIPTS_cp
[ 35%] Built target PictureTypeB_DATA_cp
[ 35%] Built target euclid_format
[ 35%] Built target nmg-sgp
[ 36%] Built target bot-bldxf
[ 36%] Built target nmg-bot
[ 36%] Built target archer_utility_FILES_cp
[ 36%] Built target nonie_r_12_cp
[ 36%] Built target rply
[ 36%] Built target g-ply
[ 36%] Built target base
[ 36%] Built target lemon
[ 36%] Built target perplex_template_cp
[ 36%] Built target re2c_bootstrap
[ 37%] Built target re2c
[ 37%] Built target perplex
[ 37%] Built target express
[ 37%] Built target libexppp
[ 37%] Built target exppp
[ 37%] Built target bwrect
[ 37%] �[32m�[1mLinking C executable ../../bin/plot3-dm�[0m
/usr/bin/ld: cannot find -llibfreetype.so.6
collect2: ld returned 1 exit status
*** Error 1 in target 'bin/plot3-dm', line 127 of src/util/CMakeFiles/plot3-dm.dir/build.make (continuing)
Build for src/util/CMakeFiles/plot3-dm.dir/build aborted
`src/util/CMakeFiles/plot3-dm.dir/build' not remade because of errors.
[ 37%] Built target plot3-dm
[ 37%] Built target cv
[ 37%] Built target articles_EN_IMAGES_cp
[ 38%] Built target docbook-docbook-articles-en
[ 38%] �[32mBuilding C object src/shapes/CMakeFiles/handle.dir/handle.c.o�[0m
cc1: warnings being treated as errors
/home/cyapp/brlcad-7.25.0/src/shapes/handle.c: In function 'main':
/home/cyapp/brlcad-7.25.0/src/shapes/handle.c:129: warning: Array size (26) smaller than format string size (27) (arg 2)
*** Error 1 in target 'src/shapes/CMakeFiles/handle.dir/handle.c.o', line 63 of src/shapes/CMakeFiles/handle.dir/build.make: cd /home/cyapp/brlcad-7.25.0/build/src/shapes && /usr/bin/cc  -DBRLCADBUILD=1 -DHAVE_CONFIG_H -DOBJ_BREP=1 -I/home/cyapp/brlcad-7.25.0/build/include -I/home/cyapp/brlcad-7.25.0/include -I/home/cyapp/brlcad-7.25.0/src/other/tcl/generic -I/home/cyapp/brlcad-7.25.0/src/other/tcl/libtommath -I/home/cyapp/brlcad-7.25.0/build/src/other/tcl/include -I/home/cyapp/brlcad-7.25.0/src/other/tcl/unix -I/home/cyapp/brlcad-7.25.0/src/other/tk/generic -I/home/cyapp/brlcad-7.25.0/src/other/openNURBS -I/home/cyapp/brlcad-7.25.0/build/src/other/openNURBS -I/home/cyapp/brlcad-7.25.0/src/other/libz -I/home/cyapp/brlcad-7.25.0/build/src/other/libz -I/home/cyapp/brlcad-7.25.0/src/other/poly2tri -I/home/cyapp/brlcad-7.25.0/src/shapes  -pipe -fno-strict-aliasing -fno-common -fexceptions -std=gnu89 -m64 -g -ggdb3 -fstack-protector-all -pedantic -pedantic-errors -Wall -Wextra -Wundef -Wfloat-equal -Wshadow -Wbad-function-cast -Wdeclaration-after-statement -Wc++-compat -Winline -Wno-long-long -Wno-variadic-macros -Werror   -o CMakeFiles/handle.dir/handle.c.o   -c /home/cyapp/brlcad-7.25.0/src/shapes/handle.c (continuing)
Build for bin/handle aborted
Build for src/shapes/CMakeFiles/handle.dir/build aborted
`src/shapes/CMakeFiles/handle.dir/build' not remade because of errors.
[ 38%] Built target handle
make: don't know how to make lib/libged.so.20.0 (prerequisite of: bin/human)(continuing)
Build for bin/human aborted
Build for src/shapes/CMakeFiles/human.dir/build aborted
`src/shapes/CMakeFiles/human.dir/build' not remade because of errors.
[ 38%] Built target human
[ 38%] Built target dauto
[ 38%] Built target c-d
[ 38%] Built target i-a
[ 38%] Built target dmod
[ 39%] Built target liboptical
[ 39%] �[32mBuilding C object src/rt/CMakeFiles/rtregis.dir/read-rtlog.c.o�[0m
cc1: warnings being treated as errors
/home/cyapp/brlcad-7.25.0/src/rt/read-rtlog.c: In function 'read_rt_file':
/home/cyapp/brlcad-7.25.0/src/rt/read-rtlog.c:187: warning: Array size (9) smaller than format string size (10) (arg 4)
*** Error 1 in target 'src/rt/CMakeFiles/rtregis.dir/read-rtlog.c.o', line 63 of src/rt/CMakeFiles/rtregis.dir/build.make: cd /home/cyapp/brlcad-7.25.0/build/src/rt && /usr/bin/cc  -DBRLCADBUILD=1 -DHAVE_CONFIG_H -I/home/cyapp/brlcad-7.25.0/build/include -I/home/cyapp/brlcad-7.25.0/include -I/home/cyapp/brlcad-7.25.0/src/other/tcl/generic -I/home/cyapp/brlcad-7.25.0/src/other/tcl/libtommath -I/home/cyapp/brlcad-7.25.0/build/src/other/tcl/include -I/home/cyapp/brlcad-7.25.0/src/other/tcl/unix -I/home/cyapp/brlcad-7.25.0/src/other/tk/generic -I/home/cyapp/brlcad-7.25.0/src/other/openNURBS -I/home/cyapp/brlcad-7.25.0/build/src/other/openNURBS -I/home/cyapp/brlcad-7.25.0/src/other/libz -I/home/cyapp/brlcad-7.25.0/build/src/other/libz -I/home/cyapp/brlcad-7.25.0/src/other/poly2tri -I/usr/X11R6/include -I/home/cyapp/brlcad-7.25.0/src/rt  -pipe -fno-strict-aliasing -fno-common -fexceptions -std=gnu89 -m64 -g -ggdb3 -fstack-protector-all -pedantic -pedantic-errors -Wall -Wextra -Wundef -Wfloat-equal -Wshadow -Wbad-function-cast -Wdeclaration-after-statement -Wc++-compat -Winline -Wno-long-long -Wno-variadic-macros -Werror   -o CMakeFiles/rtregis.dir/read-rtlog.c.o   -c /home/cyapp/brlcad-7.25.0/src/rt/read-rtlog.c (continuing)
Build for bin/rtregis aborted
Build for src/rt/CMakeFiles/rtregis.dir/build aborted
`src/rt/CMakeFiles/rtregis.dir/build' not remade because of errors.
[ 40%] Built target rtregis
[ 40%] �[32mBuilding C object src/rt/CMakeFiles/rtscale.dir/read-rtlog.c.o�[0m
cc1: warnings being treated as errors
/home/cyapp/brlcad-7.25.0/src/rt/read-rtlog.c: In function 'read_rt_file':
/home/cyapp/brlcad-7.25.0/src/rt/read-rtlog.c:187: warning: Array size (9) smaller than format string size (10) (arg 4)
*** Error 1 in target 'src/rt/CMakeFiles/rtscale.dir/read-rtlog.c.o', line 63 of src/rt/CMakeFiles/rtscale.dir/build.make: cd /home/cyapp/brlcad-7.25.0/build/src/rt && /usr/bin/cc  -DBRLCADBUILD=1 -DHAVE_CONFIG_H -I/home/cyapp/brlcad-7.25.0/build/include -I/home/cyapp/brlcad-7.25.0/include -I/home/cyapp/brlcad-7.25.0/src/other/tcl/generic -I/home/cyapp/brlcad-7.25.0/src/other/tcl/libtommath -I/home/cyapp/brlcad-7.25.0/build/src/other/tcl/include -I/home/cyapp/brlcad-7.25.0/src/other/tcl/unix -I/home/cyapp/brlcad-7.25.0/src/other/tk/generic -I/home/cyapp/brlcad-7.25.0/src/other/openNURBS -I/home/cyapp/brlcad-7.25.0/build/src/other/openNURBS -I/home/cyapp/brlcad-7.25.0/src/other/libz -I/home/cyapp/brlcad-7.25.0/build/src/other/libz -I/home/cyapp/brlcad-7.25.0/src/other/poly2tri -I/usr/X11R6/include -I/home/cyapp/brlcad-7.25.0/src/rt  -pipe -fno-strict-aliasing -fno-common -fexceptions -std=gnu89 -m64 -g -ggdb3 -fstack-protector-all -pedantic -pedantic-errors -Wall -Wextra -Wundef -Wfloat-equal -Wshadow -Wbad-function-cast -Wdeclaration-after-statement -Wc++-compat -Winline -Wno-long-long -Wno-variadic-macros -Werror   -o CMakeFiles/rtscale.dir/read-rtlog.c.o   -c /home/cyapp/brlcad-7.25.0/src/rt/read-rtlog.c (continuing)
Build for bin/rtscale aborted
Build for src/rt/CMakeFiles/rtscale.dir/build aborted
`src/rt/CMakeFiles/rtscale.dir/build' not remade because of errors.
[ 40%] Built target rtscale
[ 40%] �[32mBuilding C object src/rt/CMakeFiles/rtrange.dir/do.c.o�[0m
cc1: warnings being treated as errors
/home/cyapp/brlcad-7.25.0/src/rt/do.c: In function 'old_frame':
/home/cyapp/brlcad-7.25.0/src/rt/do.c:96: warning: Array size (128) smaller than format string size (129) (arg 3)
/home/cyapp/brlcad-7.25.0/src/rt/do.c:98: warning: Array size (128) smaller than format string size (129) (arg 3)
/home/cyapp/brlcad-7.25.0/src/rt/do.c:100: warning: Array size (128) smaller than format string size (129) (arg 3)
/home/cyapp/brlcad-7.25.0/src/rt/do.c:102: warning: Array size (128) smaller than format string size (129) (arg 3)
/home/cyapp/brlcad-7.25.0/src/rt/do.c:105: warning: Array size (128) smaller than format string size (129) (arg 3)
*** Error 1 in target 'src/rt/CMakeFiles/rtrange.dir/do.c.o', line 63 of src/rt/CMakeFiles/rtrange.dir/build.make: cd /home/cyapp/brlcad-7.25.0/build/src/rt && /usr/bin/cc  -DBRLCADBUILD=1 -DHAVE_CONFIG_H -I/home/cyapp/brlcad-7.25.0/build/include -I/home/cyapp/brlcad-7.25.0/include -I/home/cyapp/brlcad-7.25.0/src/other/tcl/generic -I/home/cyapp/brlcad-7.25.0/src/other/tcl/libtommath -I/home/cyapp/brlcad-7.25.0/build/src/other/tcl/include -I/home/cyapp/brlcad-7.25.0/src/other/tcl/unix -I/home/cyapp/brlcad-7.25.0/src/other/tk/generic -I/home/cyapp/brlcad-7.25.0/src/other/openNURBS -I/home/cyapp/brlcad-7.25.0/build/src/other/openNURBS -I/home/cyapp/brlcad-7.25.0/src/other/libz -I/home/cyapp/brlcad-7.25.0/build/src/other/libz -I/home/cyapp/brlcad-7.25.0/src/other/poly2tri -I/usr/X11R6/include -I/home/cyapp/brlcad-7.25.0/src/rt  -pipe -fno-strict-aliasing -fno-common -fexceptions -std=gnu89 -m64 -g -ggdb3 -fstack-protector-all -pedantic -pedantic-errors -Wall -Wextra -Wundef -Wfloat-equal -Wshadow -Wbad-function-cast -Wdeclaration-after-statement -Wc++-compat -Winline -Wno-long-long -Wno-variadic-macros -Werror   -o CMakeFiles/rtrange.dir/do.c.o   -c /home/cyapp/brlcad-7.25.0/src/rt/do.c (continuing)
Build for bin/rtrange aborted
Build for src/rt/CMakeFiles/rtrange.dir/build aborted
`src/rt/CMakeFiles/rtrange.dir/build' not remade because of errors.
[ 40%] Built target rtrange
[ 40%] Built target CL_FILES_cp
[ 40%] �[32m�[1mLinking C executable ../../bin/cell-fb�[0m
/usr/bin/ld: cannot find -llibfreetype.so.6
collect2: ld returned 1 exit status
*** Error 1 in target 'bin/cell-fb', line 120 of src/fb/CMakeFiles/cell-fb.dir/build.make (continuing)
Build for src/fb/CMakeFiles/cell-fb.dir/build aborted
`src/fb/CMakeFiles/cell-fb.dir/build' not remade because of errors.
[ 40%] Built target cell-fb
[ 40%] �[32m�[1mLinking C executable ../../bin/fb-png�[0m
/usr/bin/ld: cannot find -llibfreetype.so.6
collect2: ld returned 1 exit status
*** Error 1 in target 'bin/fb-png', line 145 of src/fb/CMakeFiles/fb-png.dir/build.make (continuing)
Build for src/fb/CMakeFiles/fb-png.dir/build aborted
`src/fb/CMakeFiles/fb-png.dir/build' not remade because of errors.
[ 40%] Built target fb-png
[ 40%] �[32m�[1mLinking C executable ../../bin/fb-pix�[0m
/usr/bin/ld: cannot find -llibfreetype.so.6
collect2: ld returned 1 exit status
*** Error 1 in target 'bin/fb-pix', line 145 of src/fb/CMakeFiles/fb-pix.dir/build.make (continuing)
Build for src/fb/CMakeFiles/fb-pix.dir/build aborted
`src/fb/CMakeFiles/fb-pix.dir/build' not remade because of errors.
[ 40%] Built target fb-pix
[ 40%] �[32mBuilding C object src/rt/CMakeFiles/rtrad.dir/do.c.o�[0m
cc1: warnings being treated as errors
/home/cyapp/brlcad-7.25.0/src/rt/do.c: In function 'old_frame':
/home/cyapp/brlcad-7.25.0/src/rt/do.c:96: warning: Array size (128) smaller than format string size (129) (arg 3)
/home/cyapp/brlcad-7.25.0/src/rt/do.c:98: warning: Array size (128) smaller than format string size (129) (arg 3)
/home/cyapp/brlcad-7.25.0/src/rt/do.c:100: warning: Array size (128) smaller than format string size (129) (arg 3)
/home/cyapp/brlcad-7.25.0/src/rt/do.c:102: warning: Array size (128) smaller than format string size (129) (arg 3)
/home/cyapp/brlcad-7.25.0/src/rt/do.c:105: warning: Array size (128) smaller than format string size (129) (arg 3)
*** Error 1 in target 'src/rt/CMakeFiles/rtrad.dir/do.c.o', line 63 of src/rt/CMakeFiles/rtrad.dir/build.make: cd /home/cyapp/brlcad-7.25.0/build/src/rt && /usr/bin/cc  -DBRLCADBUILD=1 -DHAVE_CONFIG_H -I/home/cyapp/brlcad-7.25.0/build/include -I/home/cyapp/brlcad-7.25.0/include -I/home/cyapp/brlcad-7.25.0/src/other/tcl/generic -I/home/cyapp/brlcad-7.25.0/src/other/tcl/libtommath -I/home/cyapp/brlcad-7.25.0/build/src/other/tcl/include -I/home/cyapp/brlcad-7.25.0/src/other/tcl/unix -I/home/cyapp/brlcad-7.25.0/src/other/tk/generic -I/home/cyapp/brlcad-7.25.0/src/other/openNURBS -I/home/cyapp/brlcad-7.25.0/build/src/other/openNURBS -I/home/cyapp/brlcad-7.25.0/src/other/libz -I/home/cyapp/brlcad-7.25.0/build/src/other/libz -I/home/cyapp/brlcad-7.25.0/src/other/poly2tri -I/usr/X11R6/include -I/home/cyapp/brlcad-7.25.0/src/rt  -pipe -fno-strict-aliasing -fno-common -fexceptions -std=gnu89 -m64 -g -ggdb3 -fstack-protector-all -pedantic -pedantic-errors -Wall -Wextra -Wundef -Wfloat-equal -Wshadow -Wbad-function-cast -Wdeclaration-after-statement -Wc++-compat -Winline -Wno-long-long -Wno-variadic-macros -Werror   -o CMakeFiles/rtrad.dir/do.c.o   -c /home/cyapp/brlcad-7.25.0/src/rt/do.c (continuing)
Build for bin/rtrad aborted
Build for src/rt/CMakeFiles/rtrad.dir/build aborted
`src/rt/CMakeFiles/rtrad.dir/build' not remade because of errors.
[ 40%] Built target rtrad
[ 40%] �[32mBuilding C object src/rt/CMakeFiles/rtcell.dir/do.c.o�[0m
cc1: warnings being treated as errors
/home/cyapp/brlcad-7.25.0/src/rt/do.c: In function 'old_frame':
/home/cyapp/brlcad-7.25.0/src/rt/do.c:96: warning: Array size (128) smaller than format string size (129) (arg 3)
/home/cyapp/brlcad-7.25.0/src/rt/do.c:98: warning: Array size (128) smaller than format string size (129) (arg 3)
/home/cyapp/brlcad-7.25.0/src/rt/do.c:100: warning: Array size (128) smaller than format string size (129) (arg 3)
/home/cyapp/brlcad-7.25.0/src/rt/do.c:102: warning: Array size (128) smaller than format string size (129) (arg 3)
/home/cyapp/brlcad-7.25.0/src/rt/do.c:105: warning: Array size (128) smaller than format string size (129) (arg 3)
*** Error 1 in target 'src/rt/CMakeFiles/rtcell.dir/do.c.o', line 63 of src/rt/CMakeFiles/rtcell.dir/build.make: cd /home/cyapp/brlcad-7.25.0/build/src/rt && /usr/bin/cc  -DBRLCADBUILD=1 -DHAVE_CONFIG_H -I/home/cyapp/brlcad-7.25.0/build/include -I/home/cyapp/brlcad-7.25.0/include -I/home/cyapp/brlcad-7.25.0/src/other/tcl/generic -I/home/cyapp/brlcad-7.25.0/src/other/tcl/libtommath -I/home/cyapp/brlcad-7.25.0/build/src/other/tcl/include -I/home/cyapp/brlcad-7.25.0/src/other/tcl/unix -I/home/cyapp/brlcad-7.25.0/src/other/tk/generic -I/home/cyapp/brlcad-7.25.0/src/other/openNURBS -I/home/cyapp/brlcad-7.25.0/build/src/other/openNURBS -I/home/cyapp/brlcad-7.25.0/src/other/libz -I/home/cyapp/brlcad-7.25.0/build/src/other/libz -I/home/cyapp/brlcad-7.25.0/src/other/poly2tri -I/usr/X11R6/include -I/home/cyapp/brlcad-7.25.0/src/rt  -pipe -fno-strict-aliasing -fno-common -fexceptions -std=gnu89 -m64 -g -ggdb3 -fstack-protector-all -pedantic -pedantic-errors -Wall -Wextra -Wundef -Wfloat-equal -Wshadow -Wbad-function-cast -Wdeclaration-after-statement -Wc++-compat -Winline -Wno-long-long -Wno-variadic-macros -Werror   -o CMakeFiles/rtcell.dir/do.c.o   -c /home/cyapp/brlcad-7.25.0/src/rt/do.c (continuing)
Build for bin/rtcell aborted
Build for src/rt/CMakeFiles/rtcell.dir/build aborted
`src/rt/CMakeFiles/rtcell.dir/build' not remade because of errors.
[ 40%] Built target rtcell
[ 40%] �[32mBuilding C object src/rt/CMakeFiles/rtweight.dir/do.c.o�[0m
cc1: warnings being treated as errors
/home/cyapp/brlcad-7.25.0/src/rt/do.c: In function 'old_frame':
/home/cyapp/brlcad-7.25.0/src/rt/do.c:96: warning: Array size (128) smaller than format string size (129) (arg 3)
/home/cyapp/brlcad-7.25.0/src/rt/do.c:98: warning: Array size (128) smaller than format string size (129) (arg 3)
/home/cyapp/brlcad-7.25.0/src/rt/do.c:100: warning: Array size (128) smaller than format string size (129) (arg 3)
/home/cyapp/brlcad-7.25.0/src/rt/do.c:102: warning: Array size (128) smaller than format string size (129) (arg 3)
/home/cyapp/brlcad-7.25.0/src/rt/do.c:105: warning: Array size (128) smaller than format string size (129) (arg 3)
*** Error 1 in target 'src/rt/CMakeFiles/rtweight.dir/do.c.o', line 63 of src/rt/CMakeFiles/rtweight.dir/build.make: cd /home/cyapp/brlcad-7.25.0/build/src/rt && /usr/bin/cc  -DBRLCADBUILD=1 -DHAVE_CONFIG_H -I/home/cyapp/brlcad-7.25.0/build/include -I/home/cyapp/brlcad-7.25.0/include -I/home/cyapp/brlcad-7.25.0/src/other/tcl/generic -I/home/cyapp/brlcad-7.25.0/src/other/tcl/libtommath -I/home/cyapp/brlcad-7.25.0/build/src/other/tcl/include -I/home/cyapp/brlcad-7.25.0/src/other/tcl/unix -I/home/cyapp/brlcad-7.25.0/src/other/tk/generic -I/home/cyapp/brlcad-7.25.0/src/other/openNURBS -I/home/cyapp/brlcad-7.25.0/build/src/other/openNURBS -I/home/cyapp/brlcad-7.25.0/src/other/libz -I/home/cyapp/brlcad-7.25.0/build/src/other/libz -I/home/cyapp/brlcad-7.25.0/src/other/poly2tri -I/usr/X11R6/include -I/home/cyapp/brlcad-7.25.0/src/rt  -pipe -fno-strict-aliasing -fno-common -fexceptions -std=gnu89 -m64 -g -ggdb3 -fstack-protector-all -pedantic -pedantic-errors -Wall -Wextra -Wundef -Wfloat-equal -Wshadow -Wbad-function-cast -Wdeclaration-after-statement -Wc++-compat -Winline -Wno-long-long -Wno-variadic-macros -Werror   -o CMakeFiles/rtweight.dir/do.c.o   -c /home/cyapp/brlcad-7.25.0/src/rt/do.c (continuing)
Build for bin/rtweight aborted
Build for src/rt/CMakeFiles/rtweight.dir/build aborted
`src/rt/CMakeFiles/rtweight.dir/build' not remade because of errors.
[ 40%] Built target rtweight
make: don't know how to make bin/asc2g (prerequisite of: share/db/woodsman.g)(continuing)
Build for share/db/woodsman.g aborted
Build for db/CMakeFiles/woodsman.g aborted
Build for woodsman.g aborted
Build for db/CMakeFiles/woodsman.g.dir/build aborted
`db/CMakeFiles/woodsman.g.dir/build' not remade because of errors.
[ 40%] Built target woodsman.g
make: don't know how to make bin/asc2g (prerequisite of: share/db/wave.g)(continuing)
Build for share/db/wave.g aborted
Build for db/CMakeFiles/wave.g aborted
Build for wave.g aborted
Build for db/CMakeFiles/wave.g.dir/build aborted
`db/CMakeFiles/wave.g.dir/build' not remade because of errors.
[ 40%] Built target wave.g
[ 40%] Built target c9128fbf1c657273ea89dedea3e3d6eb_cp
[ 40%] Built target png-pix
[ 40%] �[32m�[1mLinking C executable ../../bin/imgdims�[0m
/usr/bin/ld: cannot find -llibfreetype.so.6
collect2: ld returned 1 exit status
*** Error 1 in target 'bin/imgdims', line 119 of src/util/CMakeFiles/imgdims.dir/build.make (continuing)
Build for src/util/CMakeFiles/imgdims.dir/build aborted
`src/util/CMakeFiles/imgdims.dir/build' not remade because of errors.
[ 40%] Built target imgdims
[ 40%] �[32m�[1mLinking C executable ../../bin/plot3-X�[0m
/usr/bin/ld: cannot find -llibfreetype.so.6
collect2: ld returned 1 exit status
*** Error 1 in target 'bin/plot3-X', line 127 of src/util/CMakeFiles/plot3-X.dir/build.make (continuing)
Build for src/util/CMakeFiles/plot3-X.dir/build aborted
`src/util/CMakeFiles/plot3-X.dir/build' not remade because of errors.
[ 40%] Built target plot3-X
[ 40%] Built target fix_6r_cp
[ 40%] Built target regex-static
[ 40%] Built target lib_TCLSCRIPTS_cp
[ 40%] Built target termlib
[ 40%] Built target libtermio
make: don't know how to make lib/libtclcad.so.20.0 (prerequisite of: bin/btclsh)(continuing)
make: don't know how to make lib/libged.so.20.0(continuing)
Build for bin/btclsh aborted
Build for src/bwish/CMakeFiles/btclsh.dir/build aborted
`src/bwish/CMakeFiles/btclsh.dir/build' not remade because of errors.
[ 40%] Built target btclsh
make: don't know how to make bin/btclsh (prerequisite of: share/tclscripts/lib/tclIndex)(continuing)
Build for share/tclscripts/lib/tclIndex aborted
Build for src/tclscripts/lib/CMakeFiles/tclscripts_lib_auto_mkindex.tcl aborted
Build for tclscripts_lib_auto_mkindex.tcl aborted
Build for src/tclscripts/lib/CMakeFiles/tclscripts_lib_auto_mkindex.tcl.dir/build aborted
`src/tclscripts/lib/CMakeFiles/tclscripts_lib_auto_mkindex.tcl.dir/build' not remade because of errors.
[ 40%] Built target tclscripts_lib_auto_mkindex.tcl
[ 41%] Built target docbook-docbook-system-man3
[ 41%] Built target test_bu_b64
[ 41%] Built target util_TCLSCRIPTS_cp
[ 41%] Built target raw-g
[ 41%] Built target 778cba5d0c74223f7f5195d10da80e0c_cp
[ 41%] Built target c406129a4ee6e8c28e33dc9f37573d22_cp
make: don't know how to make bin/btclsh (prerequisite of: share/tclscripts/rtwizard/tclIndex)(continuing)
Build for share/tclscripts/rtwizard/tclIndex aborted
Build for src/tclscripts/rtwizard/CMakeFiles/tclscripts_rtwizard_auto_mkindex.tcl aborted
Build for tclscripts_rtwizard_auto_mkindex.tcl aborted
Build for src/tclscripts/rtwizard/CMakeFiles/tclscripts_rtwizard_auto_mkindex.tcl.dir/build aborted
`src/tclscripts/rtwizard/CMakeFiles/tclscripts_rtwizard_auto_mkindex.tcl.dir/build' not remade because of errors.
[ 41%] Built target tclscripts_rtwizard_auto_mkindex.tcl
[ 41%] Built target tclscripts_TCLSCRIPTS_cp
make: don't know how to make bin/btclsh (prerequisite of: share/tclscripts/pkgIndex.tcl)(continuing)
Build for share/tclscripts/pkgIndex.tcl aborted
Build for src/tclscripts/CMakeFiles/tclscripts_pkg_mkIndex.tcl aborted
Build for tclscripts_pkg_mkIndex.tcl aborted
Build for src/tclscripts/CMakeFiles/tclscripts_pkg_mkIndex.tcl.dir/build aborted
`src/tclscripts/CMakeFiles/tclscripts_pkg_mkIndex.tcl.dir/build' not remade because of errors.
[ 41%] Built target tclscripts_pkg_mkIndex.tcl
[ 41%] Built target rtwizard_lib_TCLSCRIPTS_cp
make: don't know how to make bin/btclsh (prerequisite of: share/tclscripts/rtwizard/lib/pkgIndex.tcl)(continuing)
Build for share/tclscripts/rtwizard/lib/pkgIndex.tcl aborted
Build for src/tclscripts/rtwizard/lib/CMakeFiles/tclscripts_rtwizard_lib_pkg_mkIndex.tcl aborted
Build for tclscripts_rtwizard_lib_pkg_mkIndex.tcl aborted
Build for src/tclscripts/rtwizard/lib/CMakeFiles/tclscripts_rtwizard_lib_pkg_mkIndex.tcl.dir/build aborted
`src/tclscripts/rtwizard/lib/CMakeFiles/tclscripts_rtwizard_lib_pkg_mkIndex.tcl.dir/build' not remade because of errors.
[ 41%] Built target tclscripts_rtwizard_lib_pkg_mkIndex.tcl
[ 41%] Built target lod_TCLSCRIPTS_cp
make: don't know how to make bin/btclsh (prerequisite of: share/tclscripts/lod/tclIndex)(continuing)
Build for share/tclscripts/lod/tclIndex aborted
Build for src/tclscripts/lod/CMakeFiles/tclscripts_lod_auto_mkindex.tcl aborted
Build for tclscripts_lod_auto_mkindex.tcl aborted
Build for src/tclscripts/lod/CMakeFiles/tclscripts_lod_auto_mkindex.tcl.dir/build aborted
`src/tclscripts/lod/CMakeFiles/tclscripts_lod_auto_mkindex.tcl.dir/build' not remade because of errors.
[ 41%] Built target tclscripts_lod_auto_mkindex.tcl
[ 41%] Built target geometree_TCLSCRIPTS_cp
make: don't know how to make bin/btclsh (prerequisite of: share/tclscripts/geometree/pkgIndex.tcl)(continuing)
Build for share/tclscripts/geometree/pkgIndex.tcl aborted
Build for src/tclscripts/geometree/CMakeFiles/tclscripts_geometree_pkg_mkIndex.tcl aborted
Build for tclscripts_geometree_pkg_mkIndex.tcl aborted
Build for src/tclscripts/geometree/CMakeFiles/tclscripts_geometree_pkg_mkIndex.tcl.dir/build aborted
`src/tclscripts/geometree/CMakeFiles/tclscripts_geometree_pkg_mkIndex.tcl.dir/build' not remade because of errors.
[ 42%] Built target tclscripts_geometree_pkg_mkIndex.tcl
make: don't know how to make bin/btclsh (prerequisite of: share/tclscripts/geometree/tclIndex)(continuing)
Build for share/tclscripts/geometree/tclIndex aborted
Build for src/tclscripts/geometree/CMakeFiles/tclscripts_geometree_auto_mkindex.tcl aborted
Build for tclscripts_geometree_auto_mkindex.tcl aborted
Build for src/tclscripts/geometree/CMakeFiles/tclscripts_geometree_auto_mkindex.tcl.dir/build aborted
`src/tclscripts/geometree/CMakeFiles/tclscripts_geometree_auto_mkindex.tcl.dir/build' not remade because of errors.
[ 42%] Built target tclscripts_geometree_auto_mkindex.tcl
[ 42%] Built target archer_TCLSCRIPTS_cp
make: don't know how to make bin/btclsh (prerequisite of: share/tclscripts/archer/tclIndex)(continuing)
Build for share/tclscripts/archer/tclIndex aborted
Build for src/tclscripts/archer/CMakeFiles/tclscripts_archer_auto_mkindex.tcl aborted
Build for tclscripts_archer_auto_mkindex.tcl aborted
Build for src/tclscripts/archer/CMakeFiles/tclscripts_archer_auto_mkindex.tcl.dir/build aborted
`src/tclscripts/archer/CMakeFiles/tclscripts_archer_auto_mkindex.tcl.dir/build' not remade because of errors.
[ 42%] Built target tclscripts_archer_auto_mkindex.tcl
make: don't know how to make bin/btclsh (prerequisite of: share/tclscripts/archer/pkgIndex.tcl)(continuing)
Build for share/tclscripts/archer/pkgIndex.tcl aborted
Build for src/tclscripts/archer/CMakeFiles/tclscripts_archer_pkg_mkIndex.tcl aborted
Build for tclscripts_archer_pkg_mkIndex.tcl aborted
Build for src/tclscripts/archer/CMakeFiles/tclscripts_archer_pkg_mkIndex.tcl.dir/build aborted
`src/tclscripts/archer/CMakeFiles/tclscripts_archer_pkg_mkIndex.tcl.dir/build' not remade because of errors.
[ 42%] Built target tclscripts_archer_pkg_mkIndex.tcl
make: don't know how to make bin/btclsh (prerequisite of: share/tclscripts/lib/pkgIndex.tcl)(continuing)
Build for share/tclscripts/lib/pkgIndex.tcl aborted
Build for src/tclscripts/lib/CMakeFiles/tclscripts_lib_pkg_mkIndex.tcl aborted
Build for tclscripts_lib_pkg_mkIndex.tcl aborted
Build for src/tclscripts/lib/CMakeFiles/tclscripts_lib_pkg_mkIndex.tcl.dir/build aborted
`src/tclscripts/lib/CMakeFiles/tclscripts_lib_pkg_mkIndex.tcl.dir/build' not remade because of errors.
[ 42%] Built target tclscripts_lib_pkg_mkIndex.tcl
[ 42%] Built target sdialogs_scripts_TCLSCRIPTS_cp
make: don't know how to make bin/btclsh (prerequisite of: share/tclscripts/sdialogs/scripts/tclIndex)(continuing)
Build for share/tclscripts/sdialogs/scripts/tclIndex aborted
Build for src/tclscripts/sdialogs/scripts/CMakeFiles/tclscripts_sdialogs_scripts_auto_mkindex.tcl aborted
Build for tclscripts_sdialogs_scripts_auto_mkindex.tcl aborted
Build for src/tclscripts/sdialogs/scripts/CMakeFiles/tclscripts_sdialogs_scripts_auto_mkindex.tcl.dir/build aborted
`src/tclscripts/sdialogs/scripts/CMakeFiles/tclscripts_sdialogs_scripts_auto_mkindex.tcl.dir/build' not remade because of errors.
[ 42%] Built target tclscripts_sdialogs_scripts_auto_mkindex.tcl
[ 42%] Built target hv3_TCLSCRIPTS_cp
make: don't know how to make bin/btclsh (prerequisite of: share/tclscripts/hv3/tclIndex)(continuing)
Build for share/tclscripts/hv3/tclIndex aborted
Build for src/tclscripts/hv3/CMakeFiles/tclscripts_hv3_auto_mkindex.tcl aborted
Build for tclscripts_hv3_auto_mkindex.tcl aborted
Build for src/tclscripts/hv3/CMakeFiles/tclscripts_hv3_auto_mkindex.tcl.dir/build aborted
`src/tclscripts/hv3/CMakeFiles/tclscripts_hv3_auto_mkindex.tcl.dir/build' not remade because of errors.
[ 42%] Built target tclscripts_hv3_auto_mkindex.tcl
make: don't know how to make bin/btclsh (prerequisite of: share/tclscripts/rtwizard/pkgIndex.tcl)(continuing)
Build for share/tclscripts/rtwizard/pkgIndex.tcl aborted
Build for src/tclscripts/rtwizard/CMakeFiles/tclscripts_rtwizard_pkg_mkIndex.tcl aborted
Build for tclscripts_rtwizard_pkg_mkIndex.tcl aborted
Build for src/tclscripts/rtwizard/CMakeFiles/tclscripts_rtwizard_pkg_mkIndex.tcl.dir/build aborted
`src/tclscripts/rtwizard/CMakeFiles/tclscripts_rtwizard_pkg_mkIndex.tcl.dir/build' not remade because of errors.
[ 42%] Built target tclscripts_rtwizard_pkg_mkIndex.tcl
[ 42%] Built target sdialogs_TCLSCRIPTS_cp
make: don't know how to make bin/btclsh (prerequisite of: share/tclscripts/sdialogs/tclIndex)(continuing)
Build for share/tclscripts/sdialogs/tclIndex aborted
Build for src/tclscripts/sdialogs/CMakeFiles/tclscripts_sdialogs_auto_mkindex.tcl aborted
Build for tclscripts_sdialogs_auto_mkindex.tcl aborted
Build for src/tclscripts/sdialogs/CMakeFiles/tclscripts_sdialogs_auto_mkindex.tcl.dir/build aborted
`src/tclscripts/sdialogs/CMakeFiles/tclscripts_sdialogs_auto_mkindex.tcl.dir/build' not remade because of errors.
[ 42%] Built target tclscripts_sdialogs_auto_mkindex.tcl
make: don't know how to make bin/btclsh (prerequisite of: share/tclscripts/sdialogs/pkgIndex.tcl)(continuing)
Build for share/tclscripts/sdialogs/pkgIndex.tcl aborted
Build for src/tclscripts/sdialogs/CMakeFiles/tclscripts_sdialogs_pkg_mkIndex.tcl aborted
Build for tclscripts_sdialogs_pkg_mkIndex.tcl aborted
Build for src/tclscripts/sdialogs/CMakeFiles/tclscripts_sdialogs_pkg_mkIndex.tcl.dir/build aborted
`src/tclscripts/sdialogs/CMakeFiles/tclscripts_sdialogs_pkg_mkIndex.tcl.dir/build' not remade because of errors.
[ 42%] Built target tclscripts_sdialogs_pkg_mkIndex.tcl
[ 42%] Built target pl-dm_TCLSCRIPTS_cp
make: don't know how to make bin/btclsh (prerequisite of: share/tclscripts/pl-dm/tclIndex)(continuing)
Build for share/tclscripts/pl-dm/tclIndex aborted
Build for src/tclscripts/pl-dm/CMakeFiles/tclscripts_pl-dm_auto_mkindex.tcl aborted
Build for tclscripts_pl-dm_auto_mkindex.tcl aborted
Build for src/tclscripts/pl-dm/CMakeFiles/tclscripts_pl-dm_auto_mkindex.tcl.dir/build aborted
`src/tclscripts/pl-dm/CMakeFiles/tclscripts_pl-dm_auto_mkindex.tcl.dir/build' not remade because of errors.
[ 42%] Built target tclscripts_pl-dm_auto_mkindex.tcl
[ 42%] Built target boteditor_TCLSCRIPTS_cp
make: don't know how to make bin/btclsh (prerequisite of: share/tclscripts/boteditor/tclIndex)(continuing)
Build for share/tclscripts/boteditor/tclIndex aborted
Build for src/tclscripts/boteditor/CMakeFiles/tclscripts_boteditor_auto_mkindex.tcl aborted
Build for tclscripts_boteditor_auto_mkindex.tcl aborted
Build for src/tclscripts/boteditor/CMakeFiles/tclscripts_boteditor_auto_mkindex.tcl.dir/build aborted
`src/tclscripts/boteditor/CMakeFiles/tclscripts_boteditor_auto_mkindex.tcl.dir/build' not remade because of errors.
[ 42%] Built target tclscripts_boteditor_auto_mkindex.tcl
make: don't know how to make bin/btclsh (prerequisite of: share/tclscripts/util/tclIndex)(continuing)
Build for share/tclscripts/util/tclIndex aborted
Build for src/tclscripts/util/CMakeFiles/tclscripts_util_auto_mkindex.tcl aborted
Build for tclscripts_util_auto_mkindex.tcl aborted
Build for src/tclscripts/util/CMakeFiles/tclscripts_util_auto_mkindex.tcl.dir/build aborted
`src/tclscripts/util/CMakeFiles/tclscripts_util_auto_mkindex.tcl.dir/build' not remade because of errors.
[ 42%] Built target tclscripts_util_auto_mkindex.tcl
make: don't know how to make bin/btclsh (prerequisite of: share/tclscripts/tclIndex)(continuing)
Build for share/tclscripts/tclIndex aborted
Build for src/tclscripts/CMakeFiles/tclscripts_auto_mkindex.tcl aborted
Build for tclscripts_auto_mkindex.tcl aborted
Build for src/tclscripts/CMakeFiles/tclscripts_auto_mkindex.tcl.dir/build aborted
`src/tclscripts/CMakeFiles/tclscripts_auto_mkindex.tcl.dir/build' not remade because of errors.
[ 42%] Built target tclscripts_auto_mkindex.tcl
[ 42%] Built target igraph_TCLSCRIPTS_cp
make: don't know how to make bin/btclsh (prerequisite of: share/tclscripts/igraph/tclIndex)(continuing)
Build for share/tclscripts/igraph/tclIndex aborted
Build for src/tclscripts/igraph/CMakeFiles/tclscripts_igraph_auto_mkindex.tcl aborted
Build for tclscripts_igraph_auto_mkindex.tcl aborted
Build for src/tclscripts/igraph/CMakeFiles/tclscripts_igraph_auto_mkindex.tcl.dir/build aborted
`src/tclscripts/igraph/CMakeFiles/tclscripts_igraph_auto_mkindex.tcl.dir/build' not remade because of errors.
[ 42%] Built target tclscripts_igraph_auto_mkindex.tcl
[ 42%] Built target mged_TCLSCRIPTS_cp
make: don't know how to make bin/btclsh (prerequisite of: share/tclscripts/mged/tclIndex)(continuing)
Build for share/tclscripts/mged/tclIndex aborted
Build for src/tclscripts/mged/CMakeFiles/tclscripts_mged_auto_mkindex.tcl aborted
Build for tclscripts_mged_auto_mkindex.tcl aborted
Build for src/tclscripts/mged/CMakeFiles/tclscripts_mged_auto_mkindex.tcl.dir/build aborted
`src/tclscripts/mged/CMakeFiles/tclscripts_mged_auto_mkindex.tcl.dir/build' not remade because of errors.
[ 42%] Built target tclscripts_mged_auto_mkindex.tcl
make: don't know how to make bin/btclsh (prerequisite of: share/tclscripts/util/pkgIndex.tcl)(continuing)
Build for share/tclscripts/util/pkgIndex.tcl aborted
Build for src/tclscripts/util/CMakeFiles/tclscripts_util_pkg_mkIndex.tcl aborted
Build for tclscripts_util_pkg_mkIndex.tcl aborted
Build for src/tclscripts/util/CMakeFiles/tclscripts_util_pkg_mkIndex.tcl.dir/build aborted
`src/tclscripts/util/CMakeFiles/tclscripts_util_pkg_mkIndex.tcl.dir/build' not remade because of errors.
[ 42%] Built target tclscripts_util_pkg_mkIndex.tcl
[ 42%] Built target swidgets_TCLSCRIPTS_cp
make: don't know how to make bin/btclsh (prerequisite of: share/tclscripts/swidgets/pkgIndex.tcl)(continuing)
Build for share/tclscripts/swidgets/pkgIndex.tcl aborted
Build for src/tclscripts/swidgets/CMakeFiles/tclscripts_swidgets_pkg_mkIndex.tcl aborted
Build for tclscripts_swidgets_pkg_mkIndex.tcl aborted
Build for src/tclscripts/swidgets/CMakeFiles/tclscripts_swidgets_pkg_mkIndex.tcl.dir/build aborted
`src/tclscripts/swidgets/CMakeFiles/tclscripts_swidgets_pkg_mkIndex.tcl.dir/build' not remade because of errors.
[ 42%] Built target tclscripts_swidgets_pkg_mkIndex.tcl
make: don't know how to make bin/btclsh (prerequisite of: share/tclscripts/pl-dm/pkgIndex.tcl)(continuing)
Build for share/tclscripts/pl-dm/pkgIndex.tcl aborted
Build for src/tclscripts/pl-dm/CMakeFiles/tclscripts_pl-dm_pkg_mkIndex.tcl aborted
Build for tclscripts_pl-dm_pkg_mkIndex.tcl aborted
Build for src/tclscripts/pl-dm/CMakeFiles/tclscripts_pl-dm_pkg_mkIndex.tcl.dir/build aborted
`src/tclscripts/pl-dm/CMakeFiles/tclscripts_pl-dm_pkg_mkIndex.tcl.dir/build' not remade because of errors.
[ 42%] Built target tclscripts_pl-dm_pkg_mkIndex.tcl
make: don't know how to make bin/btclsh (prerequisite of: share/tclscripts/igraph/pkgIndex.tcl)(continuing)
Build for share/tclscripts/igraph/pkgIndex.tcl aborted
Build for src/tclscripts/igraph/CMakeFiles/tclscripts_igraph_pkg_mkIndex.tcl aborted
Build for tclscripts_igraph_pkg_mkIndex.tcl aborted
Build for src/tclscripts/igraph/CMakeFiles/tclscripts_igraph_pkg_mkIndex.tcl.dir/build aborted
`src/tclscripts/igraph/CMakeFiles/tclscripts_igraph_pkg_mkIndex.tcl.dir/build' not remade because of errors.
[ 42%] Built target tclscripts_igraph_pkg_mkIndex.tcl
make: don't know how to make bin/btclsh (prerequisite of: share/tclscripts/swidgets/tclIndex)(continuing)
Build for share/tclscripts/swidgets/tclIndex aborted
Build for src/tclscripts/swidgets/CMakeFiles/tclscripts_swidgets_auto_mkindex.tcl aborted
Build for tclscripts_swidgets_auto_mkindex.tcl aborted
Build for src/tclscripts/swidgets/CMakeFiles/tclscripts_swidgets_auto_mkindex.tcl.dir/build aborted
`src/tclscripts/swidgets/CMakeFiles/tclscripts_swidgets_auto_mkindex.tcl.dir/build' not remade because of errors.
[ 42%] Built target tclscripts_swidgets_auto_mkindex.tcl
[ 42%] Built target swidgets_scripts_TCLSCRIPTS_cp
make: don't know how to make bin/btclsh (prerequisite of: share/tclscripts/swidgets/scripts/tclIndex)(continuing)
Build for share/tclscripts/swidgets/scripts/tclIndex aborted
Build for src/tclscripts/swidgets/scripts/CMakeFiles/tclscripts_swidgets_scripts_auto_mkindex.tcl aborted
Build for tclscripts_swidgets_scripts_auto_mkindex.tcl aborted
Build for src/tclscripts/swidgets/scripts/CMakeFiles/tclscripts_swidgets_scripts_auto_mkindex.tcl.dir/build aborted
`src/tclscripts/swidgets/scripts/CMakeFiles/tclscripts_swidgets_scripts_auto_mkindex.tcl.dir/build' not remade because of errors.
[ 42%] Built target tclscripts_swidgets_scripts_auto_mkindex.tcl
make: don't know how to make bin/btclsh (prerequisite of: share/tclscripts/rtwizard/lib/tclIndex)(continuing)
Build for share/tclscripts/rtwizard/lib/tclIndex aborted
Build for src/tclscripts/rtwizard/lib/CMakeFiles/tclscripts_rtwizard_lib_auto_mkindex.tcl aborted
Build for tclscripts_rtwizard_lib_auto_mkindex.tcl aborted
Build for src/tclscripts/rtwizard/lib/CMakeFiles/tclscripts_rtwizard_lib_auto_mkindex.tcl.dir/build aborted
`src/tclscripts/rtwizard/lib/CMakeFiles/tclscripts_rtwizard_lib_auto_mkindex.tcl.dir/build' not remade because of errors.
[ 42%] Built target tclscripts_rtwizard_lib_auto_mkindex.tcl
make: don't know how to make bin/btclsh (prerequisite of: share/tclscripts/hv3/pkgIndex.tcl)(continuing)
Build for share/tclscripts/hv3/pkgIndex.tcl aborted
Build for src/tclscripts/hv3/CMakeFiles/tclscripts_hv3_pkg_mkIndex.tcl aborted
Build for tclscripts_hv3_pkg_mkIndex.tcl aborted
Build for src/tclscripts/hv3/CMakeFiles/tclscripts_hv3_pkg_mkIndex.tcl.dir/build aborted
`src/tclscripts/hv3/CMakeFiles/tclscripts_hv3_pkg_mkIndex.tcl.dir/build' not remade because of errors.
[ 42%] Built target tclscripts_hv3_pkg_mkIndex.tcl
[ 42%] �[32mBuilding C object src/mged/CMakeFiles/mged.dir/clone.c.o�[0m
cc1: warnings being treated as errors
/home/cyapp/brlcad-7.25.0/src/mged/clone.c: In function 'get_name':
/home/cyapp/brlcad-7.25.0/src/mged/clone.c:235: warning: Array size (512) smaller than format string size (513) (arg 6)
*** Error 1 in target 'src/mged/CMakeFiles/mged.dir/clone.c.o', line 279 of src/mged/CMakeFiles/mged.dir/build.make: cd /home/cyapp/brlcad-7.25.0/build/src/mged && /usr/bin/cc  -DBRLCADBUILD=1 -DDM_OGL -DDM_TK -DDM_X -DHAVE_CONFIG_H -DIF_OGL -DIF_TK -DIF_X -DOBJ_BREP=1 -I/home/cyapp/brlcad-7.25.0/src/mged -I/home/cyapp/brlcad-7.25.0/build/include -I/home/cyapp/brlcad-7.25.0/include -isystem /home/cyapp/brlcad-7.25.0/build/src/other/tcl/include -isystem /home/cyapp/brlcad-7.25.0/build/src/other/openNURBS -isystem /home/cyapp/brlcad-7.25.0/build/src/other/libz -isystem /home/cyapp/brlcad-7.25.0/build/src/other/libtermlib -isystem /home/cyapp/brlcad-7.25.0/src/other/tcl/generic -isystem /home/cyapp/brlcad-7.25.0/src/other/tcl/libtommath -isystem /home/cyapp/brlcad-7.25.0/src/other/tcl/unix -isystem /home/cyapp/brlcad-7.25.0/src/other/tk/generic -isystem /home/cyapp/brlcad-7.25.0/src/other/openNURBS -isystem /home/cyapp/brlcad-7.25.0/src/other/libz -isystem /home/cyapp/brlcad-7.25.0/src/other/poly2tri -isystem /home/cyapp/brlcad-7.25.0/src/other/libtermlib -isystem /usr/X11R6/include  -pipe -fno-strict-aliasing -fno-common -fexceptions -std=gnu89 -m64 -g -ggdb3 -fstack-protector-all -pedantic -pedantic-errors -Wall -Wextra -Wundef -Wfloat-equal -Wshadow -Wbad-function-cast -Wdeclaration-after-statement -Wc++-compat -Winline -Wno-long-long -Wno-variadic-macros -Werror   -o CMakeFiles/mged.dir/clone.c.o   -c /home/cyapp/brlcad-7.25.0/src/mged/clone.c (continuing)
make: don't know how to make lib/libtclcad.so.20.0(continuing)
make: don't know how to make lib/libged.so.20.0(continuing)
Build for bin/mged aborted
Build for src/mged/CMakeFiles/mged.dir/build aborted
`src/mged/CMakeFiles/mged.dir/build' not remade because of errors.
[ 43%] Built target mged
[ 43%] �[32mBuilding C object src/conv/CMakeFiles/asc-nmg.dir/nmg/asc-nmg.c.o�[0m
cc1: warnings being treated as errors
/home/cyapp/brlcad-7.25.0/src/conv/nmg/asc-nmg.c: In function 'descr_to_nmg':
/home/cyapp/brlcad-7.25.0/src/conv/nmg/asc-nmg.c:207: warning: Array size (80) smaller than format string size (81) (arg 3)
/home/cyapp/brlcad-7.25.0/src/conv/nmg/asc-nmg.c:211: warning: Array size (80) smaller than format string size (81) (arg 3)
/home/cyapp/brlcad-7.25.0/src/conv/nmg/asc-nmg.c:233: warning: Array size (80) smaller than format string size (81) (arg 3)
/home/cyapp/brlcad-7.25.0/src/conv/nmg/asc-nmg.c:262: warning: Array size (80) smaller than format string size (81) (arg 3)
/home/cyapp/brlcad-7.25.0/src/conv/nmg/asc-nmg.c:271: warning: Array size (80) smaller than format string size (81) (arg 3)
/home/cyapp/brlcad-7.25.0/src/conv/nmg/asc-nmg.c:288: warning: Array size (80) smaller than format string size (81) (arg 3)
/home/cyapp/brlcad-7.25.0/src/conv/nmg/asc-nmg.c:316: warning: Array size (80) smaller than format string size (81) (arg 3)
*** Error 1 in target 'src/conv/CMakeFiles/asc-nmg.dir/nmg/asc-nmg.c.o', line 63 of src/conv/CMakeFiles/asc-nmg.dir/build.make: cd /home/cyapp/brlcad-7.25.0/build/src/conv && /usr/bin/cc  -DBRLCADBUILD=1 -DBRLCAD_DLL -DHAVE_CONFIG_H -DOBJ_BREP=1 -D_CONSOLE -I/home/cyapp/brlcad-7.25.0/build/include -I/home/cyapp/brlcad-7.25.0/include -isystem /home/cyapp/brlcad-7.25.0/build/src/other/tcl/include -isystem /home/cyapp/brlcad-7.25.0/build/src/other/openNURBS -isystem /home/cyapp/brlcad-7.25.0/build/src/other/libz -isystem /home/cyapp/brlcad-7.25.0/build/src/other/libregex -isystem /home/cyapp/brlcad-7.25.0/src/other/tcl/generic -isystem /home/cyapp/brlcad-7.25.0/src/other/tcl/libtommath -isystem /home/cyapp/brlcad-7.25.0/src/other/tcl/unix -isystem /home/cyapp/brlcad-7.25.0/src/other/tk/generic -isystem /home/cyapp/brlcad-7.25.0/src/other/openNURBS -isystem /home/cyapp/brlcad-7.25.0/src/other/libz -isystem /home/cyapp/brlcad-7.25.0/src/other/poly2tri -isystem /home/cyapp/brlcad-7.25.0/src/other/libregex -isystem /usr/X11R6/include -I/home/cyapp/brlcad-7.25.0/src/libgcv/plugins/obj -I/home/cyapp/brlcad-7.25.0/src/libgcv/plugins/obj/wfobj  -pipe -fno-strict-aliasing -fno-common -fexceptions -std=gnu89 -m64 -g -ggdb3 -fstack-protector-all -pedantic -pedantic-errors -Wall -Wextra -Wundef -Wfloat-equal -Wshadow -Wbad-function-cast -Wdeclaration-after-statement -Wc++-compat -Winline -Wno-long-long -Wno-variadic-macros -Werror   -o CMakeFiles/asc-nmg.dir/nmg/asc-nmg.c.o   -c /home/cyapp/brlcad-7.25.0/src/conv/nmg/asc-nmg.c (continuing)
Build for bin/asc-nmg aborted
Build for src/conv/CMakeFiles/asc-nmg.dir/build aborted
`src/conv/CMakeFiles/asc-nmg.dir/build' not remade because of errors.
[ 43%] Built target asc-nmg
[ 43%] Built target dxf-g
[ 43%] Built target g-jack
[ 43%] Built target nsis_brlcad_ico_cp
[ 43%] Built target density_DATAFILES_cp
[ 43%] Built target buildtimeend
[ 43%] Built target gtransfer
[ 43%] Built target asc2pix
[ 43%] Built target tclsh
[ 43%] Built target tktable_header_gen
[ 43%] Built target stdvds
[ 43%] Built target tester_bn_poly_scale
[ 43%] Built target tester_bn_poly_sub
[ 43%] Built target tester_bn_plane_dist
[ 43%] Built target adrt_master
[ 44%] Built target libcursor
[ 44%] �[32m�[1mLinking C executable ../../bin/fbed�[0m
/usr/bin/ld: cannot find -llibfreetype.so.6
collect2: ld returned 1 exit status
*** Error 1 in target 'bin/fbed', line 382 of src/fbed/CMakeFiles/fbed.dir/build.make (continuing)
Build for src/fbed/CMakeFiles/fbed.dir/build aborted
`src/fbed/CMakeFiles/fbed.dir/build' not remade because of errors.
[ 44%] Built target fbed
make: don't know how to make lib/libtclcad.so.20.0 (prerequisite of: bin/g2asc)(continuing)
make: don't know how to make lib/libged.so.20.0(continuing)
Build for bin/g2asc aborted
Build for src/conv/asc/CMakeFiles/g2asc.dir/build aborted
`src/conv/asc/CMakeFiles/g2asc.dir/build' not remade because of errors.
[ 44%] Built target g2asc
[ 44%] Built target docbook-docbook-books-en-2
[ 45%] Built target g-var
[ 45%] Built target poly-bot
[ 45%] Built target g-xxx_c_cp
[ 45%] Built target libgcv_vrml
[ 45%] Built target tpkg
[ 45%] Built target steputils
[ 46%] Built target stepdai
[ 46%] Built target stepcore
[ 47%] Built target exp2cxx
[ 47%] Built target step-express-CONFIG_CONTROL_DESIGN-stepg
[ 47%] Built target stepeditor
[ 47%] �[32m�[1mLinking CXX executable ../../../../bin/step-g�[0m
/home/cyapp/brlcad-7.25.0/build/lib/libstepcore.so.2.0: warning: warning: strcpy() is almost always misused, please use strlcpy()
/home/cyapp/brlcad-7.25.0/build/lib/libgdiam.so: warning: warning: rand() may return deterministic values, is that what you want?
/home/cyapp/brlcad-7.25.0/build/lib/libopenNURBS.so.2012.10: warning: warning: strcat() is almost always misused, please use strlcat()
/home/cyapp/brlcad-7.25.0/build/lib/librt.so.20.0: warning: warning: sprintf() is often misused, please use snprintf()
CMakeFiles/step-g.dir/CONFIG_CONTROL_DESIGN_stepg/SdaiCONFIG_CONTROL_DESIGN.init.cc.o: In function `SdaiCONFIG_CONTROL_DESIGNInit(Registry&)':
/home/cyapp/brlcad-7.25.0/build/src/conv/step/step-g/CONFIG_CONTROL_DESIGN_stepg/SdaiCONFIG_CONTROL_DESIGN.init.cc:21: undefined reference to `config_control_design::t_text'
/home/cyapp/brlcad-7.25.0/build/src/conv/step/step-g/CONFIG_CONTROL_DESIGN_stepg/SdaiCONFIG_CONTROL_DESIGN.h:2776: undefined reference to `config_control_design::t_person_organization_item'
[snip]
/home/cyapp/brlcad-7.25.0/build/src/conv/step/step-g/CONFIG_CONTROL_DESIGN_stepg/SdaiCONFIG_CONTROL_DESIGN.h:2776: undefined reference to `SdaiPerson_organization_item_agg::SdaiPerson_organization_item_agg(SelectTypeDescriptor*)'
CMakeFiles/step-g.dir/CONFIG_CONTROL_DESIGN_stepg/SdaiCONFIG_CONTROL_DESIGN.init.cc.o: In function `create_SdaiCertified_item_agg()':
/home/cyapp/brlcad-7.25.0/build/src/conv/step/step-g/CONFIG_CONTROL_DESIGN_stepg/SdaiCONFIG_CONTROL_DESIGN.h:2870: undefined reference to `config_control_design::t_certified_item'
[snip]
/home/cyapp/brlcad-7.25.0/src/conv/step/step-g/TrimmingSelect.cpp:104: undefined reference to `SdaiTrimming_select::operator double()'
collect2: ld returned 1 exit status
*** Error 1 in target 'bin/step-g', line 5844 of src/conv/step/step-g/CMakeFiles/step-g.dir/build.make (continuing)
Build for src/conv/step/step-g/CMakeFiles/step-g.dir/build aborted
`src/conv/step/step-g/CMakeFiles/step-g.dir/build' not remade because of errors.
[ 53%] Built target step-g
[ 54%] Built target glint
make: don't know how to make lib/libged.so.20.0 (prerequisite of: bin/gqa)(continuing)
Build for bin/gqa aborted
Build for src/gtools/CMakeFiles/gqa.dir/build aborted
`src/gtools/CMakeFiles/gqa.dir/build' not remade because of errors.
[ 54%] Built target gqa
[ 54%] Built target plot3line2
[ 54%] �[32m�[1mLinking C executable ../../bin/yuv-pix�[0m
/usr/bin/ld: cannot find -llibfreetype.so.6
collect2: ld returned 1 exit status
*** Error 1 in target 'bin/yuv-pix', line 120 of src/util/CMakeFiles/yuv-pix.dir/build.make (continuing)
Build for src/util/CMakeFiles/yuv-pix.dir/build aborted
`src/util/CMakeFiles/yuv-pix.dir/build' not remade because of errors.
[ 54%] Built target yuv-pix
[ 54%] �[32m�[1mLinking C executable ../../bin/bw-a�[0m
/usr/bin/ld: cannot find -llibfreetype.so.6
collect2: ld returned 1 exit status
*** Error 1 in target 'bin/bw-a', line 119 of src/util/CMakeFiles/bw-a.dir/build.make (continuing)
Build for src/util/CMakeFiles/bw-a.dir/build aborted
`src/util/CMakeFiles/bw-a.dir/build' not remade because of errors.
[ 54%] Built target bw-a
[ 54%] Built target pix-spm
[ 54%] �[32m�[1mLinking C executable ../../bin/fbcmap�[0m
/usr/bin/ld: cannot find -llibfreetype.so.6
collect2: ld returned 1 exit status
*** Error 1 in target 'bin/fbcmap', line 119 of src/fb/CMakeFiles/fbcmap.dir/build.make (continuing)
Build for src/fb/CMakeFiles/fbcmap.dir/build aborted
`src/fb/CMakeFiles/fbcmap.dir/build' not remade because of errors.
[ 54%] Built target fbcmap
[ 54%] �[32m�[1mLinking C executable ../../bin/bw-fb�[0m
/usr/bin/ld: cannot find -llibfreetype.so.6
collect2: ld returned 1 exit status
*** Error 1 in target 'bin/bw-fb', line 119 of src/fb/CMakeFiles/bw-fb.dir/build.make (continuing)
Build for src/fb/CMakeFiles/bw-fb.dir/build aborted
`src/fb/CMakeFiles/bw-fb.dir/build' not remade because of errors.
[ 54%] Built target bw-fb
[ 55%] �[32m�[1mLinking C executable ../../bin/cmap-fb�[0m
/usr/bin/ld: cannot find -llibfreetype.so.6
collect2: ld returned 1 exit status
*** Error 1 in target 'bin/cmap-fb', line 119 of src/fb/CMakeFiles/cmap-fb.dir/build.make (continuing)
Build for src/fb/CMakeFiles/cmap-fb.dir/build aborted
`src/fb/CMakeFiles/cmap-fb.dir/build' not remade because of errors.
[ 55%] Built target cmap-fb
[ 55%] �[32m�[1mLinking C executable ../../bin/fbfade�[0m
/usr/bin/ld: cannot find -llibfreetype.so.6
collect2: ld returned 1 exit status
*** Error 1 in target 'bin/fbfade', line 145 of src/fb/CMakeFiles/fbfade.dir/build.make (continuing)
Build for src/fb/CMakeFiles/fbfade.dir/build aborted
`src/fb/CMakeFiles/fbfade.dir/build' not remade because of errors.
[ 55%] Built target fbfade
[ 55%] Built target brepintersect
[ 55%] Built target nmgmodel
[ 55%] Built target torii
[ 55%] Built target a0cc23f53bcd956a07f21a4c957b40fa_cp
[ 55%] Built target plugins_Core_README_cp
[ 56%] Built target test_bu_semaphore
[ 56%] Built target test_bu_progname
[ 56%] Built target lessons_EN_IMAGES_cp
[ 56%] Built target docbook-docbook-lessons-en
[ 56%] Built target 3dm-g
[ 56%] Built target NIST_MBE_PMI_7-10.g
[ 56%] Built target pixcmp
[ 56%] Built target BENCHMARK_PIX_cp
[ 56%] Built target u-f
[ 56%] Built target damdf
[ 56%] �[32mBuilding C object src/conv/CMakeFiles/off-g.dir/off/off-g.c.o�[0m
cc1: warnings being treated as errors
/home/cyapp/brlcad-7.25.0/src/conv/off/off-g.c: In function 'off2nmg':
/home/cyapp/brlcad-7.25.0/src/conv/off/off-g.c:169: warning: Array size (40) smaller than format string size (41) (arg 3)
/home/cyapp/brlcad-7.25.0/src/conv/off/off-g.c:169: warning: Array size (40) smaller than format string size (41) (arg 4)
/home/cyapp/brlcad-7.25.0/src/conv/off/off-g.c:169: warning: Array size (64) smaller than format string size (65) (arg 5)
*** Error 1 in target 'src/conv/CMakeFiles/off-g.dir/off/off-g.c.o', line 63 of src/conv/CMakeFiles/off-g.dir/build.make: cd /home/cyapp/brlcad-7.25.0/build/src/conv && /usr/bin/cc  -DBRLCADBUILD=1 -DBRLCAD_DLL -DHAVE_CONFIG_H -DOBJ_BREP=1 -D_CONSOLE -I/home/cyapp/brlcad-7.25.0/build/include -I/home/cyapp/brlcad-7.25.0/include -isystem /home/cyapp/brlcad-7.25.0/build/src/other/tcl/include -isystem /home/cyapp/brlcad-7.25.0/build/src/other/openNURBS -isystem /home/cyapp/brlcad-7.25.0/build/src/other/libz -isystem /home/cyapp/brlcad-7.25.0/build/src/other/libregex -isystem /home/cyapp/brlcad-7.25.0/src/other/tcl/generic -isystem /home/cyapp/brlcad-7.25.0/src/other/tcl/libtommath -isystem /home/cyapp/brlcad-7.25.0/src/other/tcl/unix -isystem /home/cyapp/brlcad-7.25.0/src/other/tk/generic -isystem /home/cyapp/brlcad-7.25.0/src/other/openNURBS -isystem /home/cyapp/brlcad-7.25.0/src/other/libz -isystem /home/cyapp/brlcad-7.25.0/src/other/poly2tri -isystem /home/cyapp/brlcad-7.25.0/src/other/libregex -isystem /usr/X11R6/include -I/home/cyapp/brlcad-7.25.0/src/libgcv/plugins/obj -I/home/cyapp/brlcad-7.25.0/src/libgcv/plugins/obj/wfobj  -pipe -fno-strict-aliasing -fno-common -fexceptions -std=gnu89 -m64 -g -ggdb3 -fstack-protector-all -pedantic -pedantic-errors -Wall -Wextra -Wundef -Wfloat-equal -Wshadow -Wbad-function-cast -Wdeclaration-after-statement -Wc++-compat -Winline -Wno-long-long -Wno-variadic-macros -Werror   -o CMakeFiles/off-g.dir/off/off-g.c.o   -c /home/cyapp/brlcad-7.25.0/src/conv/off/off-g.c (continuing)
Build for bin/off-g aborted
Build for src/conv/CMakeFiles/off-g.dir/build aborted
`src/conv/CMakeFiles/off-g.dir/build' not remade because of errors.
[ 56%] Built target off-g
[ 56%] Built target cy-g
[ 56%] �[32mBuilding CXX object src/libgcv/plugins/obj/wfobj/CMakeFiles/libwfobj.dir/WFOBJ_PARSER_obj_grammar/obj_grammar.cpp.o�[0m
In file included from /home/cyapp/brlcad-7.25.0/build/src/libgcv/plugins/obj/wfobj/WFOBJ_PARSER_obj_grammar/obj_grammar.yy:41:
/home/cyapp/brlcad-7.25.0/src/libgcv/plugins/obj/wfobj/obj_util.h:45:1: error: "__BEGIN_DECLS" redefined
In file included from /usr/include/stdio.h:41,
                 from /home/cyapp/brlcad-7.25.0/build/src/libgcv/plugins/obj/wfobj/WFOBJ_PARSER_obj_grammar/obj_grammar.cpp:6:
/usr/include/sys/cdefs.h:264:1: error: this is the location of the previous definition
In file included from /home/cyapp/brlcad-7.25.0/build/src/libgcv/plugins/obj/wfobj/WFOBJ_PARSER_obj_grammar/obj_grammar.yy:41:
/home/cyapp/brlcad-7.25.0/src/libgcv/plugins/obj/wfobj/obj_util.h:46:1: error: "__END_DECLS" redefined
In file included from /usr/include/stdio.h:41,
                 from /home/cyapp/brlcad-7.25.0/build/src/libgcv/plugins/obj/wfobj/WFOBJ_PARSER_obj_grammar/obj_grammar.cpp:6:
/usr/include/sys/cdefs.h:265:1: error: this is the location of the previous definition
*** Error 1 in target 'src/libgcv/plugins/obj/wfobj/CMakeFiles/libwfobj.dir/WFOBJ_PARSER_obj_grammar/obj_grammar.cpp.o', line 108 of src/libgcv/plugins/obj/wfobj/CMakeFiles/libwfobj.dir/build.make: cd /home/cyapp/brlcad-7.25.0/build/src/libgcv/plugins/obj/wfobj && /usr/bin/c++   -DBRLCADBUILD=1 -DHAVE_CONFIG_H -Dlibwfobj_EXPORTS -I/home/cyapp/brlcad-7.25.0/build/include -I/home/cyapp/brlcad-7.25.0/include -isystem /home/cyapp/brlcad-7.25.0/build/src/other/tcl/include -isystem /home/cyapp/brlcad-7.25.0/build/src/other/openNURBS -isystem /home/cyapp/brlcad-7.25.0/build/src/other/libz -isystem /home/cyapp/brlcad-7.25.0/src/other/tcl/generic -isystem /home/cyapp/brlcad-7.25.0/src/other/tcl/libtommath -isystem /home/cyapp/brlcad-7.25.0/src/other/tcl/unix -isystem /home/cyapp/brlcad-7.25.0/src/other/tk/generic -isystem /home/cyapp/brlcad-7.25.0/src/other/openNURBS -isystem /home/cyapp/brlcad-7.25.0/src/other/libz -isystem /home/cyapp/brlcad-7.25.0/src/other/poly2tri -I/home/cyapp/brlcad-7.25.0/src/libgcv/plugins/obj/wfobj -I/home/cyapp/brlcad-7.25.0/build/src/libgcv/plugins/obj/wfobj/WFOBJ_SCANNER_obj_rules -I/home/cyapp/brlcad-7.25.0/build/src/libgcv/plugins/obj/wfobj/WFOBJ_PARSER_obj_grammar  -pipe -fno-strict-aliasing -fno-common -fexceptions -ftemplate-depth-128 -std=gnu++98 -m64 -g -ggdb3 -fstack-protector-all -pedantic -Wall -Wextra -Wundef -Wfloat-equal -Wshadow -Wno-inline -Wno-long-long -Wno-variadic-macros -Werror -fPIC   -o CMakeFiles/libwfobj.dir/WFOBJ_PARSER_obj_grammar/obj_grammar.cpp.o -c /home/cyapp/brlcad-7.25.0/build/src/libgcv/plugins/obj/wfobj/WFOBJ_PARSER_obj_grammar/obj_grammar.cpp (continuing)
[ 57%] �[32mBuilding CXX object src/libgcv/plugins/obj/wfobj/CMakeFiles/libwfobj.dir/WFOBJ_SCANNER_obj_rules/obj_rules.cpp.o�[0m
In file included from /home/cyapp/brlcad-7.25.0/build/src/libgcv/plugins/obj/wfobj/WFOBJ_SCANNER_obj_rules/obj_rules.cpp:24:
/home/cyapp/brlcad-7.25.0/src/libgcv/plugins/obj/wfobj/obj_util.h:45:1: error: "__BEGIN_DECLS" redefined
In file included from /usr/include/sys/errno.h:40,
                 from /usr/include/errno.h:42,
                 from /home/cyapp/brlcad-7.25.0/build/src/libgcv/plugins/obj/wfobj/WFOBJ_SCANNER_obj_rules/obj_rules.cpp:19:
/usr/include/sys/cdefs.h:264:1: error: this is the location of the previous definition
In file included from /home/cyapp/brlcad-7.25.0/build/src/libgcv/plugins/obj/wfobj/WFOBJ_SCANNER_obj_rules/obj_rules.cpp:24:
/home/cyapp/brlcad-7.25.0/src/libgcv/plugins/obj/wfobj/obj_util.h:46:1: error: "__END_DECLS" redefined
In file included from /usr/include/sys/errno.h:40,
                 from /usr/include/errno.h:42,
                 from /home/cyapp/brlcad-7.25.0/build/src/libgcv/plugins/obj/wfobj/WFOBJ_SCANNER_obj_rules/obj_rules.cpp:19:
/usr/include/sys/cdefs.h:265:1: error: this is the location of the previous definition
*** Error 1 in target 'src/libgcv/plugins/obj/wfobj/CMakeFiles/libwfobj.dir/WFOBJ_SCANNER_obj_rules/obj_rules.cpp.o', line 133 of src/libgcv/plugins/obj/wfobj/CMakeFiles/libwfobj.dir/build.make: cd /home/cyapp/brlcad-7.25.0/build/src/libgcv/plugins/obj/wfobj && /usr/bin/c++   -DBRLCADBUILD=1 -DHAVE_CONFIG_H -Dlibwfobj_EXPORTS -I/home/cyapp/brlcad-7.25.0/build/include -I/home/cyapp/brlcad-7.25.0/include -isystem /home/cyapp/brlcad-7.25.0/build/src/other/tcl/include -isystem /home/cyapp/brlcad-7.25.0/build/src/other/openNURBS -isystem /home/cyapp/brlcad-7.25.0/build/src/other/libz -isystem /home/cyapp/brlcad-7.25.0/src/other/tcl/generic -isystem /home/cyapp/brlcad-7.25.0/src/other/tcl/libtommath -isystem /home/cyapp/brlcad-7.25.0/src/other/tcl/unix -isystem /home/cyapp/brlcad-7.25.0/src/other/tk/generic -isystem /home/cyapp/brlcad-7.25.0/src/other/openNURBS -isystem /home/cyapp/brlcad-7.25.0/src/other/libz -isystem /home/cyapp/brlcad-7.25.0/src/other/poly2tri -I/home/cyapp/brlcad-7.25.0/src/libgcv/plugins/obj/wfobj -I/home/cyapp/brlcad-7.25.0/build/src/libgcv/plugins/obj/wfobj/WFOBJ_SCANNER_obj_rules -I/home/cyapp/brlcad-7.25.0/build/src/libgcv/plugins/obj/wfobj/WFOBJ_PARSER_obj_grammar  -pipe -fno-strict-aliasing -fno-common -fexceptions -ftemplate-depth-128 -std=gnu++98 -m64 -g -ggdb3 -fstack-protector-all -pedantic -Wall -Wextra -Wundef -Wfloat-equal -Wshadow -Wno-inline -Wno-long-long -Wno-variadic-macros -Werror -fPIC   -o CMakeFiles/libwfobj.dir/WFOBJ_SCANNER_obj_rules/obj_rules.cpp.o -c /home/cyapp/brlcad-7.25.0/build/src/libgcv/plugins/obj/wfobj/WFOBJ_SCANNER_obj_rules/obj_rules.cpp (continuing)
[ 57%] �[32mBuilding CXX object src/libgcv/plugins/obj/wfobj/CMakeFiles/libwfobj.dir/obj_util.cpp.o�[0m
In file included from /home/cyapp/brlcad-7.25.0/src/libgcv/plugins/obj/wfobj/obj_util.cpp:21:
/home/cyapp/brlcad-7.25.0/src/libgcv/plugins/obj/wfobj/obj_util.h:45:1: error: "__BEGIN_DECLS" redefined
In file included from /usr/include/stdint.h:22,
                 from /home/cyapp/brlcad-7.25.0/include/common.h:145,
                 from /home/cyapp/brlcad-7.25.0/src/libgcv/plugins/obj/wfobj/obj_util.h:24,
                 from /home/cyapp/brlcad-7.25.0/src/libgcv/plugins/obj/wfobj/obj_util.cpp:21:
/usr/include/sys/cdefs.h:264:1: error: this is the location of the previous definition
In file included from /home/cyapp/brlcad-7.25.0/src/libgcv/plugins/obj/wfobj/obj_util.cpp:21:
/home/cyapp/brlcad-7.25.0/src/libgcv/plugins/obj/wfobj/obj_util.h:46:1: error: "__END_DECLS" redefined
In file included from /usr/include/stdint.h:22,
                 from /home/cyapp/brlcad-7.25.0/include/common.h:145,
                 from /home/cyapp/brlcad-7.25.0/src/libgcv/plugins/obj/wfobj/obj_util.h:24,
                 from /home/cyapp/brlcad-7.25.0/src/libgcv/plugins/obj/wfobj/obj_util.cpp:21:
/usr/include/sys/cdefs.h:265:1: error: this is the location of the previous definition
*** Error 1 in target 'src/libgcv/plugins/obj/wfobj/CMakeFiles/libwfobj.dir/obj_util.cpp.o', line 157 of src/libgcv/plugins/obj/wfobj/CMakeFiles/libwfobj.dir/build.make: cd /home/cyapp/brlcad-7.25.0/build/src/libgcv/plugins/obj/wfobj && /usr/bin/c++   -DBRLCADBUILD=1 -DHAVE_CONFIG_H -Dlibwfobj_EXPORTS -I/home/cyapp/brlcad-7.25.0/build/include -I/home/cyapp/brlcad-7.25.0/include -isystem /home/cyapp/brlcad-7.25.0/build/src/other/tcl/include -isystem /home/cyapp/brlcad-7.25.0/build/src/other/openNURBS -isystem /home/cyapp/brlcad-7.25.0/build/src/other/libz -isystem /home/cyapp/brlcad-7.25.0/src/other/tcl/generic -isystem /home/cyapp/brlcad-7.25.0/src/other/tcl/libtommath -isystem /home/cyapp/brlcad-7.25.0/src/other/tcl/unix -isystem /home/cyapp/brlcad-7.25.0/src/other/tk/generic -isystem /home/cyapp/brlcad-7.25.0/src/other/openNURBS -isystem /home/cyapp/brlcad-7.25.0/src/other/libz -isystem /home/cyapp/brlcad-7.25.0/src/other/poly2tri -I/home/cyapp/brlcad-7.25.0/src/libgcv/plugins/obj/wfobj -I/home/cyapp/brlcad-7.25.0/build/src/libgcv/plugins/obj/wfobj/WFOBJ_SCANNER_obj_rules -I/home/cyapp/brlcad-7.25.0/build/src/libgcv/plugins/obj/wfobj/WFOBJ_PARSER_obj_grammar  -pipe -fno-strict-aliasing -fno-common -fexceptions -ftemplate-depth-128 -std=gnu++98 -m64 -g -ggdb3 -fstack-protector-all -pedantic -Wall -Wextra -Wundef -Wfloat-equal -Wshadow -Wno-inline -Wno-long-long -Wno-variadic-macros -Werror -fPIC   -o CMakeFiles/libwfobj.dir/obj_util.cpp.o -c /home/cyapp/brlcad-7.25.0/src/libgcv/plugins/obj/wfobj/obj_util.cpp (continuing)
[ 57%] �[32mBuilding CXX object src/libgcv/plugins/obj/wfobj/CMakeFiles/libwfobj.dir/obj_parser.cpp.o�[0m
In file included from /home/cyapp/brlcad-7.25.0/src/libgcv/plugins/obj/wfobj/obj_parser.cpp:31:
/home/cyapp/brlcad-7.25.0/src/libgcv/plugins/obj/wfobj/obj_util.h:45:1: error: "__BEGIN_DECLS" redefined
In file included from /usr/include/stdint.h:22,
                 from /home/cyapp/brlcad-7.25.0/include/common.h:145,
                 from /home/cyapp/brlcad-7.25.0/src/libgcv/plugins/obj/wfobj/obj_util.h:24,
                 from /home/cyapp/brlcad-7.25.0/src/libgcv/plugins/obj/wfobj/obj_parser.cpp:31:
/usr/include/sys/cdefs.h:264:1: error: this is the location of the previous definition
In file included from /home/cyapp/brlcad-7.25.0/src/libgcv/plugins/obj/wfobj/obj_parser.cpp:31:
/home/cyapp/brlcad-7.25.0/src/libgcv/plugins/obj/wfobj/obj_util.h:46:1: error: "__END_DECLS" redefined
In file included from /usr/include/stdint.h:22,
                 from /home/cyapp/brlcad-7.25.0/include/common.h:145,
                 from /home/cyapp/brlcad-7.25.0/src/libgcv/plugins/obj/wfobj/obj_util.h:24,
                 from /home/cyapp/brlcad-7.25.0/src/libgcv/plugins/obj/wfobj/obj_parser.cpp:31:
/usr/include/sys/cdefs.h:265:1: error: this is the location of the previous definition
*** Error 1 in target 'src/libgcv/plugins/obj/wfobj/CMakeFiles/libwfobj.dir/obj_parser.cpp.o', line 181 of src/libgcv/plugins/obj/wfobj/CMakeFiles/libwfobj.dir/build.make: cd /home/cyapp/brlcad-7.25.0/build/src/libgcv/plugins/obj/wfobj && /usr/bin/c++   -DBRLCADBUILD=1 -DHAVE_CONFIG_H -Dlibwfobj_EXPORTS -I/home/cyapp/brlcad-7.25.0/build/include -I/home/cyapp/brlcad-7.25.0/include -isystem /home/cyapp/brlcad-7.25.0/build/src/other/tcl/include -isystem /home/cyapp/brlcad-7.25.0/build/src/other/openNURBS -isystem /home/cyapp/brlcad-7.25.0/build/src/other/libz -isystem /home/cyapp/brlcad-7.25.0/src/other/tcl/generic -isystem /home/cyapp/brlcad-7.25.0/src/other/tcl/libtommath -isystem /home/cyapp/brlcad-7.25.0/src/other/tcl/unix -isystem /home/cyapp/brlcad-7.25.0/src/other/tk/generic -isystem /home/cyapp/brlcad-7.25.0/src/other/openNURBS -isystem /home/cyapp/brlcad-7.25.0/src/other/libz -isystem /home/cyapp/brlcad-7.25.0/src/other/poly2tri -I/home/cyapp/brlcad-7.25.0/src/libgcv/plugins/obj/wfobj -I/home/cyapp/brlcad-7.25.0/build/src/libgcv/plugins/obj/wfobj/WFOBJ_SCANNER_obj_rules -I/home/cyapp/brlcad-7.25.0/build/src/libgcv/plugins/obj/wfobj/WFOBJ_PARSER_obj_grammar  -pipe -fno-strict-aliasing -fno-common -fexceptions -ftemplate-depth-128 -std=gnu++98 -m64 -g -ggdb3 -fstack-protector-all -pedantic -Wall -Wextra -Wundef -Wfloat-equal -Wshadow -Wno-inline -Wno-long-long -Wno-variadic-macros -Werror -fPIC   -o CMakeFiles/libwfobj.dir/obj_parser.cpp.o -c /home/cyapp/brlcad-7.25.0/src/libgcv/plugins/obj/wfobj/obj_parser.cpp (continuing)
Build for lib/libwfobj.so.20.0 aborted
Build for lib/libwfobj.so aborted
Build for src/libgcv/plugins/obj/wfobj/CMakeFiles/libwfobj.dir/build aborted
`src/libgcv/plugins/obj/wfobj/CMakeFiles/libwfobj.dir/build' not remade because of errors.
[ 57%] Built target libwfobj
[ 57%] �[32mBuilding C object src/conv/CMakeFiles/obj-g.dir/obj-g.c.o�[0m
In file included from /home/cyapp/brlcad-7.25.0/src/libgcv/plugins/obj/wfobj/obj_parser.h:30,
                 from /home/cyapp/brlcad-7.25.0/src/conv/obj-g.c:64:
/home/cyapp/brlcad-7.25.0/src/libgcv/plugins/obj/wfobj/obj_util.h:48:1: error: "__BEGIN_DECLS" redefined
In file included from /usr/include/stdint.h:22,
                 from /home/cyapp/brlcad-7.25.0/include/common.h:145,
                 from /home/cyapp/brlcad-7.25.0/src/conv/obj-g.c:45:
/usr/include/sys/cdefs.h:264:1: error: this is the location of the previous definition
In file included from /home/cyapp/brlcad-7.25.0/src/libgcv/plugins/obj/wfobj/obj_parser.h:30,
                 from /home/cyapp/brlcad-7.25.0/src/conv/obj-g.c:64:
/home/cyapp/brlcad-7.25.0/src/libgcv/plugins/obj/wfobj/obj_util.h:49:1: error: "__END_DECLS" redefined
In file included from /usr/include/stdint.h:22,
                 from /home/cyapp/brlcad-7.25.0/include/common.h:145,
                 from /home/cyapp/brlcad-7.25.0/src/conv/obj-g.c:45:
/usr/include/sys/cdefs.h:265:1: error: this is the location of the previous definition
*** Error 1 in target 'src/conv/CMakeFiles/obj-g.dir/obj-g.c.o', line 63 of src/conv/CMakeFiles/obj-g.dir/build.make: cd /home/cyapp/brlcad-7.25.0/build/src/conv && /usr/bin/cc  -DBRLCADBUILD=1 -DBRLCAD_DLL -DHAVE_CONFIG_H -DOBJ_BREP=1 -D_CONSOLE -I/home/cyapp/brlcad-7.25.0/build/include -I/home/cyapp/brlcad-7.25.0/include -isystem /home/cyapp/brlcad-7.25.0/build/src/other/tcl/include -isystem /home/cyapp/brlcad-7.25.0/build/src/other/openNURBS -isystem /home/cyapp/brlcad-7.25.0/build/src/other/libz -isystem /home/cyapp/brlcad-7.25.0/build/src/other/libregex -isystem /home/cyapp/brlcad-7.25.0/src/other/tcl/generic -isystem /home/cyapp/brlcad-7.25.0/src/other/tcl/libtommath -isystem /home/cyapp/brlcad-7.25.0/src/other/tcl/unix -isystem /home/cyapp/brlcad-7.25.0/src/other/tk/generic -isystem /home/cyapp/brlcad-7.25.0/src/other/openNURBS -isystem /home/cyapp/brlcad-7.25.0/src/other/libz -isystem /home/cyapp/brlcad-7.25.0/src/other/poly2tri -isystem /home/cyapp/brlcad-7.25.0/src/other/libregex -isystem /usr/X11R6/include -I/home/cyapp/brlcad-7.25.0/src/libgcv/plugins/obj -I/home/cyapp/brlcad-7.25.0/src/libgcv/plugins/obj/wfobj  -pipe -fno-strict-aliasing -fno-common -fexceptions -std=gnu89 -m64 -g -ggdb3 -fstack-protector-all -pedantic -pedantic-errors -Wall -Wextra -Wundef -Wfloat-equal -Wshadow -Wbad-function-cast -Wdeclaration-after-statement -Wc++-compat -Winline -Wno-long-long -Wno-variadic-macros -Werror   -o CMakeFiles/obj-g.dir/obj-g.c.o   -c /home/cyapp/brlcad-7.25.0/src/conv/obj-g.c (continuing)
make: don't know how to make lib/libwfobj.so.20.0(continuing)
Build for bin/obj-g aborted
Build for src/conv/CMakeFiles/obj-g.dir/build aborted
`src/conv/CMakeFiles/obj-g.dir/build' not remade because of errors.
[ 57%] Built target obj-g
[ 57%] Built target g-euclid
[ 57%] Built target pix2asc
[ 57%] Built target fftc
[ 57%] Built target tester_icv_size_up
[ 57%] Built target gdiff
[ 57%] Built target PictureTypeE_DATA_cp
[ 57%] Built target libmultispectral
[ 57%] Built target ssamp-bw
[ 57%] Built target pyramid
[ 57%] Built target globe
[ 57%] Built target fast4-g
[ 57%] Built target Generic_Twin.g
[ 57%] Built target bw-pix
[ 57%] Built target pixbackgnd
[ 57%] Built target tabsub
[ 57%] Built target fence
[ 57%] �[32mBuilding C object src/rt/CMakeFiles/rtg3.dir/do.c.o�[0m
cc1: warnings being treated as errors
/home/cyapp/brlcad-7.25.0/src/rt/do.c: In function 'old_frame':
/home/cyapp/brlcad-7.25.0/src/rt/do.c:96: warning: Array size (128) smaller than format string size (129) (arg 3)
/home/cyapp/brlcad-7.25.0/src/rt/do.c:98: warning: Array size (128) smaller than format string size (129) (arg 3)
/home/cyapp/brlcad-7.25.0/src/rt/do.c:100: warning: Array size (128) smaller than format string size (129) (arg 3)
/home/cyapp/brlcad-7.25.0/src/rt/do.c:102: warning: Array size (128) smaller than format string size (129) (arg 3)
/home/cyapp/brlcad-7.25.0/src/rt/do.c:105: warning: Array size (128) smaller than format string size (129) (arg 3)
*** Error 1 in target 'src/rt/CMakeFiles/rtg3.dir/do.c.o', line 63 of src/rt/CMakeFiles/rtg3.dir/build.make: cd /home/cyapp/brlcad-7.25.0/build/src/rt && /usr/bin/cc  -DBRLCADBUILD=1 -DHAVE_CONFIG_H -DRT_TXT_OUTPUT -I/home/cyapp/brlcad-7.25.0/build/include -I/home/cyapp/brlcad-7.25.0/include -I/home/cyapp/brlcad-7.25.0/src/other/tcl/generic -I/home/cyapp/brlcad-7.25.0/src/other/tcl/libtommath -I/home/cyapp/brlcad-7.25.0/build/src/other/tcl/include -I/home/cyapp/brlcad-7.25.0/src/other/tcl/unix -I/home/cyapp/brlcad-7.25.0/src/other/tk/generic -I/home/cyapp/brlcad-7.25.0/src/other/openNURBS -I/home/cyapp/brlcad-7.25.0/build/src/other/openNURBS -I/home/cyapp/brlcad-7.25.0/src/other/libz -I/home/cyapp/brlcad-7.25.0/build/src/other/libz -I/home/cyapp/brlcad-7.25.0/src/other/poly2tri -I/usr/X11R6/include -I/home/cyapp/brlcad-7.25.0/src/rt  -pipe -fno-strict-aliasing -fno-common -fexceptions -std=gnu89 -m64 -g -ggdb3 -fstack-protector-all -pedantic -pedantic-errors -Wall -Wextra -Wundef -Wfloat-equal -Wshadow -Wbad-function-cast -Wdeclaration-after-statement -Wc++-compat -Winline -Wno-long-long -Wno-variadic-macros -Werror   -o CMakeFiles/rtg3.dir/do.c.o   -c /home/cyapp/brlcad-7.25.0/src/rt/do.c (continuing)
Build for bin/rtg3 aborted
Build for src/rt/CMakeFiles/rtg3.dir/build aborted
`src/rt/CMakeFiles/rtg3.dir/build' not remade because of errors.
[ 58%] Built target rtg3
make: don't know how to make lib/libged.so.20.0 (prerequisite of: bin/tire)(continuing)
Build for bin/tire aborted
Build for src/shapes/CMakeFiles/tire.dir/build aborted
`src/shapes/CMakeFiles/tire.dir/build' not remade because of errors.
[ 58%] Built target tire
[ 59%] Built target tgf-g
[ 59%] �[32mBuilding C object src/rt/CMakeFiles/libremrt.dir/do.c.o�[0m
cc1: warnings being treated as errors
/home/cyapp/brlcad-7.25.0/src/rt/do.c: In function 'old_frame':
/home/cyapp/brlcad-7.25.0/src/rt/do.c:96: warning: Array size (128) smaller than format string size (129) (arg 3)
/home/cyapp/brlcad-7.25.0/src/rt/do.c:98: warning: Array size (128) smaller than format string size (129) (arg 3)
/home/cyapp/brlcad-7.25.0/src/rt/do.c:100: warning: Array size (128) smaller than format string size (129) (arg 3)
/home/cyapp/brlcad-7.25.0/src/rt/do.c:102: warning: Array size (128) smaller than format string size (129) (arg 3)
/home/cyapp/brlcad-7.25.0/src/rt/do.c:105: warning: Array size (128) smaller than format string size (129) (arg 3)
*** Error 1 in target 'src/rt/CMakeFiles/libremrt.dir/do.c.o', line 63 of src/rt/CMakeFiles/libremrt.dir/build.make: cd /home/cyapp/brlcad-7.25.0/build/src/rt && /usr/bin/cc  -DBRLCADBUILD=1 -DHAVE_CONFIG_H -I/home/cyapp/brlcad-7.25.0/build/include -I/home/cyapp/brlcad-7.25.0/include -I/home/cyapp/brlcad-7.25.0/src/other/tcl/generic -I/home/cyapp/brlcad-7.25.0/src/other/tcl/libtommath -I/home/cyapp/brlcad-7.25.0/build/src/other/tcl/include -I/home/cyapp/brlcad-7.25.0/src/other/tcl/unix -I/home/cyapp/brlcad-7.25.0/src/other/tk/generic -I/home/cyapp/brlcad-7.25.0/src/other/openNURBS -I/home/cyapp/brlcad-7.25.0/build/src/other/openNURBS -I/home/cyapp/brlcad-7.25.0/src/other/libz -I/home/cyapp/brlcad-7.25.0/build/src/other/libz -I/home/cyapp/brlcad-7.25.0/src/other/poly2tri -I/usr/X11R6/include -I/home/cyapp/brlcad-7.25.0/src/rt  -pipe -fno-strict-aliasing -fno-common -fexceptions -std=gnu89 -m64 -g -ggdb3 -fstack-protector-all -pedantic -pedantic-errors -Wall -Wextra -Wundef -Wfloat-equal -Wshadow -Wbad-function-cast -Wdeclaration-after-statement -Wc++-compat -Winline -Wno-long-long -Wno-variadic-macros -Werror   -o CMakeFiles/libremrt.dir/do.c.o   -c /home/cyapp/brlcad-7.25.0/src/rt/do.c (continuing)
Build for lib/libremrt.a aborted
Build for src/rt/CMakeFiles/libremrt.dir/build aborted
`src/rt/CMakeFiles/libremrt.dir/build' not remade because of errors.
[ 60%] Built target libremrt
[ 60%] �[32mBuilding C object src/rt/CMakeFiles/rtxray.dir/do.c.o�[0m
cc1: warnings being treated as errors
/home/cyapp/brlcad-7.25.0/src/rt/do.c: In function 'old_frame':
/home/cyapp/brlcad-7.25.0/src/rt/do.c:96: warning: Array size (128) smaller than format string size (129) (arg 3)
/home/cyapp/brlcad-7.25.0/src/rt/do.c:98: warning: Array size (128) smaller than format string size (129) (arg 3)
/home/cyapp/brlcad-7.25.0/src/rt/do.c:100: warning: Array size (128) smaller than format string size (129) (arg 3)
/home/cyapp/brlcad-7.25.0/src/rt/do.c:102: warning: Array size (128) smaller than format string size (129) (arg 3)
/home/cyapp/brlcad-7.25.0/src/rt/do.c:105: warning: Array size (128) smaller than format string size (129) (arg 3)
*** Error 1 in target 'src/rt/CMakeFiles/rtxray.dir/do.c.o', line 63 of src/rt/CMakeFiles/rtxray.dir/build.make: cd /home/cyapp/brlcad-7.25.0/build/src/rt && /usr/bin/cc  -DBRLCADBUILD=1 -DHAVE_CONFIG_H -I/home/cyapp/brlcad-7.25.0/build/include -I/home/cyapp/brlcad-7.25.0/include -I/home/cyapp/brlcad-7.25.0/src/other/tcl/generic -I/home/cyapp/brlcad-7.25.0/src/other/tcl/libtommath -I/home/cyapp/brlcad-7.25.0/build/src/other/tcl/include -I/home/cyapp/brlcad-7.25.0/src/other/tcl/unix -I/home/cyapp/brlcad-7.25.0/src/other/tk/generic -I/home/cyapp/brlcad-7.25.0/src/other/openNURBS -I/home/cyapp/brlcad-7.25.0/build/src/other/openNURBS -I/home/cyapp/brlcad-7.25.0/src/other/libz -I/home/cyapp/brlcad-7.25.0/build/src/other/libz -I/home/cyapp/brlcad-7.25.0/src/other/poly2tri -I/usr/X11R6/include -I/home/cyapp/brlcad-7.25.0/src/rt  -pipe -fno-strict-aliasing -fno-common -fexceptions -std=gnu89 -m64 -g -ggdb3 -fstack-protector-all -pedantic -pedantic-errors -Wall -Wextra -Wundef -Wfloat-equal -Wshadow -Wbad-function-cast -Wdeclaration-after-statement -Wc++-compat -Winline -Wno-long-long -Wno-variadic-macros -Werror   -o CMakeFiles/rtxray.dir/do.c.o   -c /home/cyapp/brlcad-7.25.0/src/rt/do.c (continuing)
Build for bin/rtxray aborted
Build for src/rt/CMakeFiles/rtxray.dir/build aborted
`src/rt/CMakeFiles/rtxray.dir/build' not remade because of errors.
[ 60%] Built target rtxray
[ 60%] Built target test_bu_str
[ 60%] Built target dauto2
[ 60%] Built target ustats
[ 60%] Built target test_bu_uuid
[ 60%] Built target test_bu_redblack
[ 60%] Built target test_bu_gethostname
[ 60%] Built target showtherm
[ 61%] Built target plot3-tek
[ 61%] Built target bw-ps
[ 61%] Built target plot3color
make: don't know how to make lib/libtclcad.so.20.0 (prerequisite of: bin/bwish)(continuing)
make: don't know how to make lib/libged.so.20.0(continuing)
Build for bin/bwish aborted
Build for src/bwish/CMakeFiles/bwish.dir/build aborted
`src/bwish/CMakeFiles/bwish.dir/build' not remade because of errors.
[ 61%] Built target bwish
[ 61%] Built target presentations_EN_IMAGES_cp
[ 61%] Built target docbook-docbook-presentations-en
[ 61%] Built target mged_tcl_DATA_cp
[ 61%] Built target lens
[ 62%] Built target surfaceintersect
[ 62%] Built target bottest
[ 62%] Built target pipe
[ 62%] Built target articles_IT_IMAGES_cp
[ 62%] Built target docbook-docbook-articles-hy
make: don't know how to make bin/asc2g (prerequisite of: share/db/sphflake.g)(continuing)
Build for share/db/sphflake.g aborted
Build for db/CMakeFiles/sphflake.g aborted
Build for sphflake.g aborted
Build for db/CMakeFiles/sphflake.g.dir/build aborted
`db/CMakeFiles/sphflake.g.dir/build' not remade because of errors.
[ 62%] Built target sphflake.g
make: don't know how to make bin/asc2g (prerequisite of: share/db/world.g)(continuing)
Build for share/db/world.g aborted
Build for db/CMakeFiles/world.g aborted
Build for world.g aborted
Build for db/CMakeFiles/world.g.dir/build aborted
`db/CMakeFiles/world.g.dir/build' not remade because of errors.
[ 62%] Built target world.g
make: don't know how to make bin/asc2g (prerequisite of: share/db/galileo.g)(continuing)
Build for share/db/galileo.g aborted
Build for db/CMakeFiles/galileo.g aborted
Build for galileo.g aborted
Build for db/CMakeFiles/galileo.g.dir/build aborted
`db/CMakeFiles/galileo.g.dir/build' not remade because of errors.
[ 62%] Built target galileo.g
[ 62%] Built target a-d
[ 62%] Built target picket_fence
[ 62%] Built target dstats
[ 63%] Built target d2-c
[ 64%] Built target scriptsort
[ 64%] Built target lessons_ES_IMAGES_cp
[ 65%] Built target docbook-docbook-lessons-es
[ 65%] Built target ifftc
[ 65%] Built target libfft
[ 65%] Built target itclstub
[ 65%] Built target tester_icv_operations
[ 65%] Built target bw-imp
[ 65%] Built target pixelswap
[ 65%] Built target dpix-pix
[ 67%] Built target utahrle
[ 67%] Built target pix-rle
[ 67%] Built target Business_Jet.g
[ 67%] Built target pixmerge
[ 67%] Built target mac-pix
[ 67%] Built target bwdiff
[ 67%] Built target decimate
[ 67%] �[32mBuilding C object src/shapes/CMakeFiles/window.dir/window.c.o�[0m
cc1: warnings being treated as errors
/home/cyapp/brlcad-7.25.0/src/shapes/window.c: In function 'main':
/home/cyapp/brlcad-7.25.0/src/shapes/window.c:110: warning: Array size (26) smaller than format string size (27) (arg 2)
*** Error 1 in target 'src/shapes/CMakeFiles/window.dir/window.c.o', line 63 of src/shapes/CMakeFiles/window.dir/build.make: cd /home/cyapp/brlcad-7.25.0/build/src/shapes && /usr/bin/cc  -DBRLCADBUILD=1 -DHAVE_CONFIG_H -DOBJ_BREP=1 -I/home/cyapp/brlcad-7.25.0/build/include -I/home/cyapp/brlcad-7.25.0/include -I/home/cyapp/brlcad-7.25.0/src/other/tcl/generic -I/home/cyapp/brlcad-7.25.0/src/other/tcl/libtommath -I/home/cyapp/brlcad-7.25.0/build/src/other/tcl/include -I/home/cyapp/brlcad-7.25.0/src/other/tcl/unix -I/home/cyapp/brlcad-7.25.0/src/other/tk/generic -I/home/cyapp/brlcad-7.25.0/src/other/openNURBS -I/home/cyapp/brlcad-7.25.0/build/src/other/openNURBS -I/home/cyapp/brlcad-7.25.0/src/other/libz -I/home/cyapp/brlcad-7.25.0/build/src/other/libz -I/home/cyapp/brlcad-7.25.0/src/other/poly2tri -I/home/cyapp/brlcad-7.25.0/src/shapes  -pipe -fno-strict-aliasing -fno-common -fexceptions -std=gnu89 -m64 -g -ggdb3 -fstack-protector-all -pedantic -pedantic-errors -Wall -Wextra -Wundef -Wfloat-equal -Wshadow -Wbad-function-cast -Wdeclaration-after-statement -Wc++-compat -Winline -Wno-long-long -Wno-variadic-macros -Werror   -o CMakeFiles/window.dir/window.c.o   -c /home/cyapp/brlcad-7.25.0/src/shapes/window.c (continuing)
Build for bin/window aborted
Build for src/shapes/CMakeFiles/window.dir/build aborted
`src/shapes/CMakeFiles/window.dir/build' not remade because of errors.
[ 67%] Built target window
[ 67%] �[32mBuilding C object src/shapes/CMakeFiles/bolt.dir/bolt.c.o�[0m
cc1: warnings being treated as errors
/home/cyapp/brlcad-7.25.0/src/shapes/bolt.c: In function 'main':
/home/cyapp/brlcad-7.25.0/src/shapes/bolt.c:143: warning: Array size (26) smaller than format string size (27) (arg 2)
*** Error 1 in target 'src/shapes/CMakeFiles/bolt.dir/bolt.c.o', line 63 of src/shapes/CMakeFiles/bolt.dir/build.make: cd /home/cyapp/brlcad-7.25.0/build/src/shapes && /usr/bin/cc  -DBRLCADBUILD=1 -DHAVE_CONFIG_H -DOBJ_BREP=1 -I/home/cyapp/brlcad-7.25.0/build/include -I/home/cyapp/brlcad-7.25.0/include -I/home/cyapp/brlcad-7.25.0/src/other/tcl/generic -I/home/cyapp/brlcad-7.25.0/src/other/tcl/libtommath -I/home/cyapp/brlcad-7.25.0/build/src/other/tcl/include -I/home/cyapp/brlcad-7.25.0/src/other/tcl/unix -I/home/cyapp/brlcad-7.25.0/src/other/tk/generic -I/home/cyapp/brlcad-7.25.0/src/other/openNURBS -I/home/cyapp/brlcad-7.25.0/build/src/other/openNURBS -I/home/cyapp/brlcad-7.25.0/src/other/libz -I/home/cyapp/brlcad-7.25.0/build/src/other/libz -I/home/cyapp/brlcad-7.25.0/src/other/poly2tri -I/home/cyapp/brlcad-7.25.0/src/shapes  -pipe -fno-strict-aliasing -fno-common -fexceptions -std=gnu89 -m64 -g -ggdb3 -fstack-protector-all -pedantic -pedantic-errors -Wall -Wextra -Wundef -Wfloat-equal -Wshadow -Wbad-function-cast -Wdeclaration-after-statement -Wc++-compat -Winline -Wno-long-long -Wno-variadic-macros -Werror   -o CMakeFiles/bolt.dir/bolt.c.o   -c /home/cyapp/brlcad-7.25.0/src/shapes/bolt.c (continuing)
Build for bin/bolt aborted
Build for src/shapes/CMakeFiles/bolt.dir/build aborted
`src/shapes/CMakeFiles/bolt.dir/build' not remade because of errors.
[ 67%] Built target bolt
[ 67%] �[32mBuilding C object src/shapes/CMakeFiles/gastank.dir/gastank.c.o�[0m
cc1: warnings being treated as errors
/home/cyapp/brlcad-7.25.0/src/shapes/gastank.c: In function 'main':
/home/cyapp/brlcad-7.25.0/src/shapes/gastank.c:120: warning: Array size (26) smaller than format string size (27) (arg 2)
*** Error 1 in target 'src/shapes/CMakeFiles/gastank.dir/gastank.c.o', line 63 of src/shapes/CMakeFiles/gastank.dir/build.make: cd /home/cyapp/brlcad-7.25.0/build/src/shapes && /usr/bin/cc  -DBRLCADBUILD=1 -DHAVE_CONFIG_H -DOBJ_BREP=1 -I/home/cyapp/brlcad-7.25.0/build/include -I/home/cyapp/brlcad-7.25.0/include -I/home/cyapp/brlcad-7.25.0/src/other/tcl/generic -I/home/cyapp/brlcad-7.25.0/src/other/tcl/libtommath -I/home/cyapp/brlcad-7.25.0/build/src/other/tcl/include -I/home/cyapp/brlcad-7.25.0/src/other/tcl/unix -I/home/cyapp/brlcad-7.25.0/src/other/tk/generic -I/home/cyapp/brlcad-7.25.0/src/other/openNURBS -I/home/cyapp/brlcad-7.25.0/build/src/other/openNURBS -I/home/cyapp/brlcad-7.25.0/src/other/libz -I/home/cyapp/brlcad-7.25.0/build/src/other/libz -I/home/cyapp/brlcad-7.25.0/src/other/poly2tri -I/home/cyapp/brlcad-7.25.0/src/shapes  -pipe -fno-strict-aliasing -fno-common -fexceptions -std=gnu89 -m64 -g -ggdb3 -fstack-protector-all -pedantic -pedantic-errors -Wall -Wextra -Wundef -Wfloat-equal -Wshadow -Wbad-function-cast -Wdeclaration-after-statement -Wc++-compat -Winline -Wno-long-long -Wno-variadic-macros -Werror   -o CMakeFiles/gastank.dir/gastank.c.o   -c /home/cyapp/brlcad-7.25.0/src/shapes/gastank.c (continuing)
Build for bin/gastank aborted
Build for src/shapes/CMakeFiles/gastank.dir/build aborted
`src/shapes/CMakeFiles/gastank.dir/build' not remade because of errors.
[ 67%] Built target gastank
make: don't know how to make bin/asc2g (prerequisite of: share/db/cornell.g)(continuing)
Build for share/db/cornell.g aborted
Build for db/CMakeFiles/cornell.g aborted
Build for cornell.g aborted
Build for db/CMakeFiles/cornell.g.dir/build aborted
`db/CMakeFiles/cornell.g.dir/build' not remade because of errors.
[ 67%] Built target cornell.g
make: don't know how to make bin/asc2g (prerequisite of: share/db/m35.g)(continuing)
Build for share/db/m35.g aborted
Build for db/CMakeFiles/m35.g aborted
Build for m35.g aborted
Build for db/CMakeFiles/m35.g.dir/build aborted
`db/CMakeFiles/m35.g.dir/build' not remade because of errors.
[ 67%] Built target m35.g
make: don't know how to make bin/asc2g (prerequisite of: share/db/moss.g)(continuing)
Build for share/db/moss.g aborted
Build for db/CMakeFiles/moss.g aborted
Build for moss.g aborted
Build for db/CMakeFiles/moss.g.dir/build aborted
`db/CMakeFiles/moss.g.dir/build' not remade because of errors.
[ 67%] Built target moss.g
make: don't know how to make bin/asc2g (prerequisite of: share/db/tank_car.g)(continuing)
Build for share/db/tank_car.g aborted
Build for db/CMakeFiles/tank_car.g aborted
Build for tank_car.g aborted
Build for db/CMakeFiles/tank_car.g.dir/build aborted
`db/CMakeFiles/tank_car.g.dir/build' not remade because of errors.
[ 67%] Built target tank_car.g
make: don't know how to make bin/asc2g (prerequisite of: share/db/terra.g)(continuing)
Build for share/db/terra.g aborted
Build for db/CMakeFiles/terra.g aborted
Build for terra.g aborted
Build for db/CMakeFiles/terra.g.dir/build aborted
`db/CMakeFiles/terra.g.dir/build' not remade because of errors.
[ 67%] Built target terra.g
make: don't know how to make bin/asc2g (prerequisite of: share/db/truck.g)(continuing)
Build for share/db/truck.g aborted
Build for db/CMakeFiles/truck.g aborted
Build for truck.g aborted
Build for db/CMakeFiles/truck.g.dir/build aborted
`db/CMakeFiles/truck.g.dir/build' not remade because of errors.
[ 67%] Built target truck.g
make: don't know how to make bin/asc2g (prerequisite of: share/db/crod.g)(continuing)
Build for share/db/crod.g aborted
Build for db/CMakeFiles/crod.g aborted
Build for crod.g aborted
Build for db/CMakeFiles/crod.g.dir/build aborted
`db/CMakeFiles/crod.g.dir/build' not remade because of errors.
[ 67%] Built target crod.g
make: don't know how to make bin/asc2g (prerequisite of: share/db/toyjeep.g)(continuing)
Build for share/db/toyjeep.g aborted
Build for db/CMakeFiles/toyjeep.g aborted
Build for toyjeep.g aborted
Build for db/CMakeFiles/toyjeep.g.dir/build aborted
`db/CMakeFiles/toyjeep.g.dir/build' not remade because of errors.
[ 67%] Built target toyjeep.g
[ 67%] Built target fix_polysolids
[ 67%] �[32mBuilding C object src/util/CMakeFiles/ttcp.dir/ttcp.c.o�[0m
cc1: warnings being treated as errors
/home/cyapp/brlcad-7.25.0/src/util/ttcp.c: In function 'prusage':
/home/cyapp/brlcad-7.25.0/src/util/ttcp.c:322: warning: format '%ld' expects type 'long int', but argument 3 has type 'long long int'
/home/cyapp/brlcad-7.25.0/src/util/ttcp.c:328: warning: format '%ld' expects type 'long int', but argument 3 has type 'long long int'
/home/cyapp/brlcad-7.25.0/src/util/ttcp.c:335: warning: format '%ld' expects type 'long int', but argument 3 has type 'long long int'
*** Error 1 in target 'src/util/CMakeFiles/ttcp.dir/ttcp.c.o', line 63 of src/util/CMakeFiles/ttcp.dir/build.make: cd /home/cyapp/brlcad-7.25.0/build/src/util && /usr/bin/cc  -DBRLCADBUILD=1 -DHAVE_CONFIG_H -I/home/cyapp/brlcad-7.25.0/src/util -I/home/cyapp/brlcad-7.25.0/build/include -I/home/cyapp/brlcad-7.25.0/include -isystem /home/cyapp/brlcad-7.25.0/build/src/other/tcl/include -isystem /home/cyapp/brlcad-7.25.0/build/src/other/openNURBS -isystem /home/cyapp/brlcad-7.25.0/build/src/other/libz -isystem /home/cyapp/brlcad-7.25.0/build/src/other/libpng -isystem /home/cyapp/brlcad-7.25.0/src/other/tcl/generic -isystem /home/cyapp/brlcad-7.25.0/src/other/tcl/libtommath -isystem /home/cyapp/brlcad-7.25.0/src/other/tcl/unix -isystem /home/cyapp/brlcad-7.25.0/src/other/tk/generic -isystem /home/cyapp/brlcad-7.25.0/src/other/openNURBS -isystem /home/cyapp/brlcad-7.25.0/src/other/libz -isystem /home/cyapp/brlcad-7.25.0/src/other/poly2tri -isystem /home/cyapp/brlcad-7.25.0/src/other/libutahrle/include -isystem /home/cyapp/brlcad-7.25.0/src/other/libpng -isystem /usr/X11R6/include  -pipe -fno-strict-aliasing -fno-common -fexceptions -std=gnu89 -m64 -g -ggdb3 -fstack-protector-all -pedantic -pedantic-errors -Wall -Wextra -Wundef -Wfloat-equal -Wshadow -Wbad-function-cast -Wdeclaration-after-statement -Wc++-compat -Winline -Wno-long-long -Wno-variadic-macros -Werror   -o CMakeFiles/ttcp.dir/ttcp.c.o   -c /home/cyapp/brlcad-7.25.0/src/util/ttcp.c (continuing)
Build for bin/ttcp aborted
Build for src/util/CMakeFiles/ttcp.dir/build aborted
`src/util/CMakeFiles/ttcp.dir/build' not remade because of errors.
[ 67%] Built target ttcp
[ 67%] Built target plot3debug
[ 67%] Built target pixsaturate
[ 67%] �[32mBuilding C object src/rt/CMakeFiles/librttherm.dir/do.c.o�[0m
cc1: warnings being treated as errors
/home/cyapp/brlcad-7.25.0/src/rt/do.c: In function 'old_frame':
/home/cyapp/brlcad-7.25.0/src/rt/do.c:96: warning: Array size (128) smaller than format string size (129) (arg 3)
/home/cyapp/brlcad-7.25.0/src/rt/do.c:98: warning: Array size (128) smaller than format string size (129) (arg 3)
/home/cyapp/brlcad-7.25.0/src/rt/do.c:100: warning: Array size (128) smaller than format string size (129) (arg 3)
/home/cyapp/brlcad-7.25.0/src/rt/do.c:102: warning: Array size (128) smaller than format string size (129) (arg 3)
/home/cyapp/brlcad-7.25.0/src/rt/do.c:105: warning: Array size (128) smaller than format string size (129) (arg 3)
*** Error 1 in target 'src/rt/CMakeFiles/librttherm.dir/do.c.o', line 63 of src/rt/CMakeFiles/librttherm.dir/build.make: cd /home/cyapp/brlcad-7.25.0/build/src/rt && /usr/bin/cc  -DBRLCADBUILD=1 -DHAVE_CONFIG_H -I/home/cyapp/brlcad-7.25.0/build/include -I/home/cyapp/brlcad-7.25.0/include -I/home/cyapp/brlcad-7.25.0/src/other/tcl/generic -I/home/cyapp/brlcad-7.25.0/src/other/tcl/libtommath -I/home/cyapp/brlcad-7.25.0/build/src/other/tcl/include -I/home/cyapp/brlcad-7.25.0/src/other/tcl/unix -I/home/cyapp/brlcad-7.25.0/src/other/tk/generic -I/home/cyapp/brlcad-7.25.0/src/other/openNURBS -I/home/cyapp/brlcad-7.25.0/build/src/other/openNURBS -I/home/cyapp/brlcad-7.25.0/src/other/libz -I/home/cyapp/brlcad-7.25.0/build/src/other/libz -I/home/cyapp/brlcad-7.25.0/src/other/poly2tri -I/usr/X11R6/include -I/home/cyapp/brlcad-7.25.0/src/rt  -pipe -fno-strict-aliasing -fno-common -fexceptions -std=gnu89 -m64 -g -ggdb3 -fstack-protector-all -pedantic -pedantic-errors -Wall -Wextra -Wundef -Wfloat-equal -Wshadow -Wbad-function-cast -Wdeclaration-after-statement -Wc++-compat -Winline -Wno-long-long -Wno-variadic-macros -Werror   -o CMakeFiles/librttherm.dir/do.c.o   -c /home/cyapp/brlcad-7.25.0/src/rt/do.c (continuing)
Build for lib/librttherm.a aborted
Build for src/rt/CMakeFiles/librttherm.dir/build aborted
`src/rt/CMakeFiles/librttherm.dir/build' not remade because of errors.
[ 67%] Built target librttherm
make: don't know how to make lib/libged.so.20.0 (prerequisite of: bin/rttherm)(continuing)
Warning: target lib/librttherm.a does not have any command (BUG)
Build for bin/rttherm aborted
Build for src/rttherm/CMakeFiles/rttherm.dir/build aborted
`src/rttherm/CMakeFiles/rttherm.dir/build' not remade because of errors.
[ 67%] Built target rttherm
[ 67%] Built target anim_fly
[ 67%] Built target anim_turn
[ 67%] Built target librender
[ 67%] Built target isst_tcl_cp
make: don't know how to make lib/libtclcad.so.20.0 (prerequisite of: bin/isst)(continuing)
make: don't know how to make lib/libged.so.20.0(continuing)
Build for bin/isst aborted
Build for src/adrt/CMakeFiles/isst.dir/build aborted
`src/adrt/CMakeFiles/isst.dir/build' not remade because of errors.
[ 67%] Built target isst
[ 67%] Built target pixfields
[ 67%] Built target bw-rle
[ 67%] Built target bwcrop
[ 67%] Built target pixfieldsep
[ 67%] Built target test_dvec
[ 67%] Built target manuals_mged_HTML_cp
[ 67%] Built target anim_tutorial_HTML_cp
[ 67%] Built target libbu_HTML_cp
[ 67%] Built target nurb_example_c_cp
[ 67%] Built target test_point_intersect
[ 67%] Built target i-f
[ 67%] Built target dwin
[ 67%] Built target dfft
[ 67%] Built target docbook-docbook-articles-ru
[ 67%] Built target librt_HTML_cp
[ 67%] Built target toplevel_HTML_cp
[ 67%] Built target relnotes_5_HTML_cp
[ 67%] Built target documentation_DATA_cp
[ 67%] Built target documentation_mged_old_DATA_cp
[ 67%] Built target PIX_LOG_cp
[ 67%] Built target relnotes_5_summary_HTML_cp
[ 67%] Built target ap-pix
[ 67%] Built target pixinterp2x
[ 67%] Built target pixblend
[ 67%] �[32m�[1mLinking C executable ../../bin/pix-ppm�[0m
/usr/bin/ld: cannot find -llibfreetype.so.6
collect2: ld returned 1 exit status
*** Error 1 in target 'bin/pix-ppm', line 119 of src/util/CMakeFiles/pix-ppm.dir/build.make (continuing)
Build for src/util/CMakeFiles/pix-ppm.dir/build aborted
`src/util/CMakeFiles/pix-ppm.dir/build' not remade because of errors.
[ 67%] Built target pix-ppm
[ 67%] Built target beset
[ 67%] Built target remapid
[ 67%] Built target bwscale
[ 67%] �[32m�[1mLinking C executable ../../bin/bw-png�[0m
/usr/bin/ld: cannot find -llibfreetype.so.6
collect2: ld returned 1 exit status
*** Error 1 in target 'bin/bw-png', line 119 of src/util/CMakeFiles/bw-png.dir/build.make (continuing)
Build for src/util/CMakeFiles/bw-png.dir/build aborted
`src/util/CMakeFiles/bw-png.dir/build' not remade because of errors.
[ 67%] Built target bw-png
[ 67%] Built target pixrect
[ 67%] �[32m�[1mLinking C executable ../../bin/fb-rle�[0m
/usr/bin/ld: cannot find -llibfreetype.so.6
collect2: ld returned 1 exit status
*** Error 1 in target 'bin/fb-rle', line 146 of src/fb/CMakeFiles/fb-rle.dir/build.make (continuing)
Build for src/fb/CMakeFiles/fb-rle.dir/build aborted
`src/fb/CMakeFiles/fb-rle.dir/build' not remade because of errors.
[ 67%] Built target fb-rle
[ 67%] �[32m�[1mLinking C executable ../../bin/fbstretch�[0m
/usr/bin/ld: cannot find -llibfreetype.so.6
collect2: ld returned 1 exit status
*** Error 1 in target 'bin/fbstretch', line 145 of src/fb/CMakeFiles/fbstretch.dir/build.make (continuing)
Build for src/fb/CMakeFiles/fbstretch.dir/build aborted
`src/fb/CMakeFiles/fbstretch.dir/build' not remade because of errors.
[ 67%] Built target fbstretch
[ 67%] Built target vdeck
[ 67%] �[32m�[1mLinking C executable ../../bin/pixflip-fb�[0m
/usr/bin/ld: cannot find -llibfreetype.so.6
collect2: ld returned 1 exit status
*** Error 1 in target 'bin/pixflip-fb', line 119 of src/fb/CMakeFiles/pixflip-fb.dir/build.make (continuing)
Build for src/fb/CMakeFiles/pixflip-fb.dir/build aborted
`src/fb/CMakeFiles/pixflip-fb.dir/build' not remade because of errors.
[ 67%] Built target pixflip-fb
[ 67%] Built target pix2g
[ 67%] �[32mBuilding C object src/nirt/CMakeFiles/nirt.dir/nirt.c.o�[0m
cc1: warnings being treated as errors
/home/cyapp/brlcad-7.25.0/src/nirt/nirt.c: In function 'main':
/home/cyapp/brlcad-7.25.0/src/nirt/nirt.c:434: warning: Array size (1024) smaller than format string size (1025) (arg 3)
*** Error 1 in target 'src/nirt/CMakeFiles/nirt.dir/nirt.c.o', line 63 of src/nirt/CMakeFiles/nirt.dir/build.make: cd /home/cyapp/brlcad-7.25.0/build/src/nirt && /usr/bin/cc  -DBRLCADBUILD=1 -DDFLT_SHELL=\"/bin/sh\" -DHAVE_CONFIG_H -I/home/cyapp/brlcad-7.25.0/build/include -I/home/cyapp/brlcad-7.25.0/include -I/home/cyapp/brlcad-7.25.0/src/other/tcl/generic -I/home/cyapp/brlcad-7.25.0/src/other/tcl/libtommath -I/home/cyapp/brlcad-7.25.0/build/src/other/tcl/include -I/home/cyapp/brlcad-7.25.0/src/other/tcl/unix -I/home/cyapp/brlcad-7.25.0/src/other/tk/generic -I/usr/X11R6/include -I/home/cyapp/brlcad-7.25.0/src/other/openNURBS -I/home/cyapp/brlcad-7.25.0/build/src/other/openNURBS -I/home/cyapp/brlcad-7.25.0/src/other/libz -I/home/cyapp/brlcad-7.25.0/build/src/other/libz -I/home/cyapp/brlcad-7.25.0/src/other/poly2tri  -pipe -fno-strict-aliasing -fno-common -fexceptions -std=gnu89 -m64 -g -ggdb3 -fstack-protector-all -pedantic -pedantic-errors -Wall -Wextra -Wundef -Wfloat-equal -Wshadow -Wbad-function-cast -Wdeclaration-after-statement -Wc++-compat -Winline -Wno-long-long -Wno-variadic-macros -Werror   -o CMakeFiles/nirt.dir/nirt.c.o   -c /home/cyapp/brlcad-7.25.0/src/nirt/nirt.c (continuing)
Build for bin/nirt aborted
Build for src/nirt/CMakeFiles/nirt.dir/build aborted
`src/nirt/CMakeFiles/nirt.dir/build' not remade because of errors.
[ 68%] Built target nirt
[ 68%] Built target nirt_sfiles_cp
[ 68%] Built target anim_offset
[ 68%] Built target anim_orient
[ 68%] Built target anim_hardtrack
[ 68%] Built target tabinterp
[ 68%] �[32m�[1mLinking C executable ../../bin/pix-png�[0m
/usr/bin/ld: cannot find -llibfreetype.so.6
collect2: ld returned 1 exit status
*** Error 1 in target 'bin/pix-png', line 119 of src/util/CMakeFiles/pix-png.dir/build.make (continuing)
Build for src/util/CMakeFiles/pix-png.dir/build aborted
`src/util/CMakeFiles/pix-png.dir/build' not remade because of errors.
[ 68%] Built target pix-png
[ 68%] Built target g-nmg
[ 68%] Built target g-off
make: don't know how to make lib/libged.so.20.0 (prerequisite of: bin/bot_dump)(continuing)
Build for bin/bot_dump aborted
Build for src/conv/CMakeFiles/bot_dump.dir/build aborted
`src/conv/CMakeFiles/bot_dump.dir/build' not remade because of errors.
[ 68%] Built target bot_dump
[ 68%] �[32m�[1mLinking C shared library ../../../lib/libtkpng.so�[0m
/usr/bin/ld: cannot find -llibfreetype.so.6
collect2: ld returned 1 exit status
*** Error 1 in target 'lib/libtkpng.so.0.8', line 135 of src/other/tkpng/CMakeFiles/tkpng.dir/build.make (continuing)
Build for lib/libtkpng.so aborted
Build for src/other/tkpng/CMakeFiles/tkpng.dir/build aborted
`src/other/tkpng/CMakeFiles/tkpng.dir/build' not remade because of errors.
[ 68%] Built target tkpng
[ 68%] Built target viewpoint-g
[ 68%] Built target proe-g
[ 68%] Built target comgeom-g
[ 68%] Built target walk_example
[ 68%] Built target g-raw
[ 68%] Built target docbook-docbook-system-mann-1
[ 68%] Built target png_info
[ 68%] Built target buffer
[ 68%] Built target rle-pix
[ 68%] Built target g-dxf
[ 68%] Built target nastran-g
[ 68%] Built target bot_shell-vtk
[ 68%] Built target tankill-g
[ 68%] Built target ringworld
[ 68%] Built target vegetation
[ 68%] Built target metaball
[ 68%] Built target dpeak
[ 68%] Built target ihist
[ 68%] Built target d-bw
[ 69%] �[32m�[1mLinking C executable ../../bin/fbcolor�[0m
/usr/bin/ld: cannot find -llibfreetype.so.6
collect2: ld returned 1 exit status
*** Error 1 in target 'bin/fbcolor', line 121 of src/fb/CMakeFiles/fbcolor.dir/build.make (continuing)
Build for src/fb/CMakeFiles/fbcolor.dir/build aborted
`src/fb/CMakeFiles/fbcolor.dir/build' not remade because of errors.
[ 69%] Built target fbcolor
[ 69%] �[32m�[1mLinking C executable ../../bin/png-fb�[0m
/usr/bin/ld: cannot find -llibfreetype.so.6
collect2: ld returned 1 exit status
*** Error 1 in target 'bin/png-fb', line 119 of src/fb/CMakeFiles/png-fb.dir/build.make (continuing)
Build for src/fb/CMakeFiles/png-fb.dir/build aborted
`src/fb/CMakeFiles/png-fb.dir/build' not remade because of errors.
[ 69%] Built target png-fb
[ 69%] �[32m�[1mLinking C executable ../../bin/spm-fb�[0m
/usr/bin/ld: cannot find -llibfreetype.so.6
collect2: ld returned 1 exit status
*** Error 1 in target 'bin/spm-fb', line 120 of src/fb/CMakeFiles/spm-fb.dir/build.make (continuing)
Build for src/fb/CMakeFiles/spm-fb.dir/build aborted
`src/fb/CMakeFiles/spm-fb.dir/build' not remade because of errors.
[ 69%] Built target spm-fb
[ 69%] Built target tester_bn_complex
[ 69%] Built target tester_bn_mat
[ 69%] �[32m�[1mLinking C executable ../../bin/rtshot�[0m
/usr/bin/ld: cannot find -llibfreetype.so.6
collect2: ld returned 1 exit status
*** Error 1 in target 'bin/rtshot', line 132 of src/rt/CMakeFiles/rtshot.dir/build.make (continuing)
Build for src/rt/CMakeFiles/rtshot.dir/build aborted
`src/rt/CMakeFiles/rtshot.dir/build' not remade because of errors.
[ 69%] Built target rtshot
[ 69%] �[32mBuilding C object src/rt/CMakeFiles/rt.dir/do.c.o�[0m
cc1: warnings being treated as errors
/home/cyapp/brlcad-7.25.0/src/rt/do.c: In function 'old_frame':
/home/cyapp/brlcad-7.25.0/src/rt/do.c:96: warning: Array size (128) smaller than format string size (129) (arg 3)
/home/cyapp/brlcad-7.25.0/src/rt/do.c:98: warning: Array size (128) smaller than format string size (129) (arg 3)
/home/cyapp/brlcad-7.25.0/src/rt/do.c:100: warning: Array size (128) smaller than format string size (129) (arg 3)
/home/cyapp/brlcad-7.25.0/src/rt/do.c:102: warning: Array size (128) smaller than format string size (129) (arg 3)
/home/cyapp/brlcad-7.25.0/src/rt/do.c:105: warning: Array size (128) smaller than format string size (129) (arg 3)
*** Error 1 in target 'src/rt/CMakeFiles/rt.dir/do.c.o', line 63 of src/rt/CMakeFiles/rt.dir/build.make: cd /home/cyapp/brlcad-7.25.0/build/src/rt && /usr/bin/cc  -DBRLCADBUILD=1 -DHAVE_CONFIG_H -I/home/cyapp/brlcad-7.25.0/build/include -I/home/cyapp/brlcad-7.25.0/include -I/home/cyapp/brlcad-7.25.0/src/other/tcl/generic -I/home/cyapp/brlcad-7.25.0/src/other/tcl/libtommath -I/home/cyapp/brlcad-7.25.0/build/src/other/tcl/include -I/home/cyapp/brlcad-7.25.0/src/other/tcl/unix -I/home/cyapp/brlcad-7.25.0/src/other/tk/generic -I/home/cyapp/brlcad-7.25.0/src/other/openNURBS -I/home/cyapp/brlcad-7.25.0/build/src/other/openNURBS -I/home/cyapp/brlcad-7.25.0/src/other/libz -I/home/cyapp/brlcad-7.25.0/build/src/other/libz -I/home/cyapp/brlcad-7.25.0/src/other/poly2tri -I/usr/X11R6/include -I/home/cyapp/brlcad-7.25.0/src/rt  -pipe -fno-strict-aliasing -fno-common -fexceptions -std=gnu89 -m64 -g -ggdb3 -fstack-protector-all -pedantic -pedantic-errors -Wall -Wextra -Wundef -Wfloat-equal -Wshadow -Wbad-function-cast -Wdeclaration-after-statement -Wc++-compat -Winline -Wno-long-long -Wno-variadic-macros -Werror   -o CMakeFiles/rt.dir/do.c.o   -c /home/cyapp/brlcad-7.25.0/src/rt/do.c (continuing)
Build for bin/rt aborted
Build for src/rt/CMakeFiles/rt.dir/build aborted
`src/rt/CMakeFiles/rt.dir/build' not remade because of errors.
[ 69%] Built target rt
[ 69%] �[32mBuilding C object src/rt/CMakeFiles/rthide.dir/do.c.o�[0m
cc1: warnings being treated as errors
/home/cyapp/brlcad-7.25.0/src/rt/do.c: In function 'old_frame':
/home/cyapp/brlcad-7.25.0/src/rt/do.c:96: warning: Array size (128) smaller than format string size (129) (arg 3)
/home/cyapp/brlcad-7.25.0/src/rt/do.c:98: warning: Array size (128) smaller than format string size (129) (arg 3)
/home/cyapp/brlcad-7.25.0/src/rt/do.c:100: warning: Array size (128) smaller than format string size (129) (arg 3)
/home/cyapp/brlcad-7.25.0/src/rt/do.c:102: warning: Array size (128) smaller than format string size (129) (arg 3)
/home/cyapp/brlcad-7.25.0/src/rt/do.c:105: warning: Array size (128) smaller than format string size (129) (arg 3)
*** Error 1 in target 'src/rt/CMakeFiles/rthide.dir/do.c.o', line 63 of src/rt/CMakeFiles/rthide.dir/build.make: cd /home/cyapp/brlcad-7.25.0/build/src/rt && /usr/bin/cc  -DBRLCADBUILD=1 -DHAVE_CONFIG_H -I/home/cyapp/brlcad-7.25.0/build/include -I/home/cyapp/brlcad-7.25.0/include -I/home/cyapp/brlcad-7.25.0/src/other/tcl/generic -I/home/cyapp/brlcad-7.25.0/src/other/tcl/libtommath -I/home/cyapp/brlcad-7.25.0/build/src/other/tcl/include -I/home/cyapp/brlcad-7.25.0/src/other/tcl/unix -I/home/cyapp/brlcad-7.25.0/src/other/tk/generic -I/home/cyapp/brlcad-7.25.0/src/other/openNURBS -I/home/cyapp/brlcad-7.25.0/build/src/other/openNURBS -I/home/cyapp/brlcad-7.25.0/src/other/libz -I/home/cyapp/brlcad-7.25.0/build/src/other/libz -I/home/cyapp/brlcad-7.25.0/src/other/poly2tri -I/usr/X11R6/include -I/home/cyapp/brlcad-7.25.0/src/rt  -pipe -fno-strict-aliasing -fno-common -fexceptions -std=gnu89 -m64 -g -ggdb3 -fstack-protector-all -pedantic -pedantic-errors -Wall -Wextra -Wundef -Wfloat-equal -Wshadow -Wbad-function-cast -Wdeclaration-after-statement -Wc++-compat -Winline -Wno-long-long -Wno-variadic-macros -Werror   -o CMakeFiles/rthide.dir/do.c.o   -c /home/cyapp/brlcad-7.25.0/src/rt/do.c (continuing)
Build for bin/rthide aborted
Build for src/rt/CMakeFiles/rthide.dir/build aborted
`src/rt/CMakeFiles/rthide.dir/build' not remade because of errors.
[ 69%] Built target rthide
[ 69%] �[32mBuilding C object src/conv/CMakeFiles/euclid-g.dir/euclid/euclid-g.c.o�[0m
cc1: warnings being treated as errors
/home/cyapp/brlcad-7.25.0/src/conv/euclid/euclid-g.c: In function 'euclid_to_brlcad':
/home/cyapp/brlcad-7.25.0/src/conv/euclid/euclid-g.c:346: warning: Array size (80) smaller than format string size (81) (arg 3)
*** Error 1 in target 'src/conv/CMakeFiles/euclid-g.dir/euclid/euclid-g.c.o', line 63 of src/conv/CMakeFiles/euclid-g.dir/build.make: cd /home/cyapp/brlcad-7.25.0/build/src/conv && /usr/bin/cc  -DBRLCADBUILD=1 -DBRLCAD_DLL -DHAVE_CONFIG_H -DOBJ_BREP=1 -D_CONSOLE -I/home/cyapp/brlcad-7.25.0/build/include -I/home/cyapp/brlcad-7.25.0/include -isystem /home/cyapp/brlcad-7.25.0/build/src/other/tcl/include -isystem /home/cyapp/brlcad-7.25.0/build/src/other/openNURBS -isystem /home/cyapp/brlcad-7.25.0/build/src/other/libz -isystem /home/cyapp/brlcad-7.25.0/build/src/other/libregex -isystem /home/cyapp/brlcad-7.25.0/src/other/tcl/generic -isystem /home/cyapp/brlcad-7.25.0/src/other/tcl/libtommath -isystem /home/cyapp/brlcad-7.25.0/src/other/tcl/unix -isystem /home/cyapp/brlcad-7.25.0/src/other/tk/generic -isystem /home/cyapp/brlcad-7.25.0/src/other/openNURBS -isystem /home/cyapp/brlcad-7.25.0/src/other/libz -isystem /home/cyapp/brlcad-7.25.0/src/other/poly2tri -isystem /home/cyapp/brlcad-7.25.0/src/other/libregex -isystem /usr/X11R6/include -I/home/cyapp/brlcad-7.25.0/src/libgcv/plugins/obj -I/home/cyapp/brlcad-7.25.0/src/libgcv/plugins/obj/wfobj  -pipe -fno-strict-aliasing -fno-common -fexceptions -std=gnu89 -m64 -g -ggdb3 -fstack-protector-all -pedantic -pedantic-errors -Wall -Wextra -Wundef -Wfloat-equal -Wshadow -Wbad-function-cast -Wdeclaration-after-statement -Wc++-compat -Winline -Wno-long-long -Wno-variadic-macros -Werror   -o CMakeFiles/euclid-g.dir/euclid/euclid-g.c.o   -c /home/cyapp/brlcad-7.25.0/src/conv/euclid/euclid-g.c (continuing)
Build for bin/euclid-g aborted
Build for src/conv/CMakeFiles/euclid-g.dir/build aborted
`src/conv/CMakeFiles/euclid-g.dir/build' not remade because of errors.
[ 69%] Built target euclid-g
[ 69%] Built target rpatch
[ 69%] Built target dbupgrade
[ 69%] Built target g-xxx_facets
make: don't know how to make lib/libtclcad.so.20.0 (prerequisite of: bin/ssampview)(continuing)
make: don't know how to make lib/libged.so.20.0(continuing)
Build for bin/ssampview aborted
Build for src/rttherm/CMakeFiles/ssampview.dir/build aborted
`src/rttherm/CMakeFiles/ssampview.dir/build' not remade because of errors.
[ 69%] Built target ssampview
make: don't know how to make bin/step-g (prerequisite of: share/db/NIST_MBE_PMI_11.g)(continuing)
Build for share/db/NIST_MBE_PMI_11.g aborted
Build for db/nist/CMakeFiles/NIST_MBE_PMI_11.g aborted
Build for NIST_MBE_PMI_11.g aborted
Build for db/nist/CMakeFiles/NIST_MBE_PMI_11.g.dir/build aborted
`db/nist/CMakeFiles/NIST_MBE_PMI_11.g.dir/build' not remade because of errors.
[ 69%] Built target NIST_MBE_PMI_11.g
make: don't know how to make bin/step-g (prerequisite of: share/db/NIST_MBE_PMI_2.g)(continuing)
Build for share/db/NIST_MBE_PMI_2.g aborted
Build for db/nist/CMakeFiles/NIST_MBE_PMI_2.g aborted
Build for NIST_MBE_PMI_2.g aborted
Build for db/nist/CMakeFiles/NIST_MBE_PMI_2.g.dir/build aborted
`db/nist/CMakeFiles/NIST_MBE_PMI_2.g.dir/build' not remade because of errors.
[ 69%] Built target NIST_MBE_PMI_2.g
[ 69%] Built target tester_bn_poly_synthetic_div
[ 69%] Built target tester_bn_qmath
[ 69%] Built target tester_bn_poly_add
[ 69%] �[32mBuilding C object src/libgcv/plugins/obj/CMakeFiles/libgcv_obj.dir/obj_read.c.o�[0m
In file included from /home/cyapp/brlcad-7.25.0/src/libgcv/plugins/obj/wfobj/obj_parser.h:30,
                 from /home/cyapp/brlcad-7.25.0/src/libgcv/plugins/obj/obj_read.c:58:
/home/cyapp/brlcad-7.25.0/src/libgcv/plugins/obj/wfobj/obj_util.h:48:1: error: "__BEGIN_DECLS" redefined
In file included from /usr/include/stdint.h:22,
                 from /home/cyapp/brlcad-7.25.0/include/common.h:145,
                 from /home/cyapp/brlcad-7.25.0/src/libgcv/plugins/obj/obj_read.c:42:
/usr/include/sys/cdefs.h:264:1: error: this is the location of the previous definition
In file included from /home/cyapp/brlcad-7.25.0/src/libgcv/plugins/obj/wfobj/obj_parser.h:30,
                 from /home/cyapp/brlcad-7.25.0/src/libgcv/plugins/obj/obj_read.c:58:
/home/cyapp/brlcad-7.25.0/src/libgcv/plugins/obj/wfobj/obj_util.h:49:1: error: "__END_DECLS" redefined
In file included from /usr/include/stdint.h:22,
                 from /home/cyapp/brlcad-7.25.0/include/common.h:145,
                 from /home/cyapp/brlcad-7.25.0/src/libgcv/plugins/obj/obj_read.c:42:
/usr/include/sys/cdefs.h:265:1: error: this is the location of the previous definition
*** Error 1 in target 'src/libgcv/plugins/obj/CMakeFiles/libgcv_obj.dir/obj_read.c.o', line 63 of src/libgcv/plugins/obj/CMakeFiles/libgcv_obj.dir/build.make: cd /home/cyapp/brlcad-7.25.0/build/src/libgcv/plugins/obj && /usr/bin/cc  -DBRLCADBUILD=1 -DHAVE_CONFIG_H -Dlibgcv_obj_EXPORTS -I/home/cyapp/brlcad-7.25.0/build/include -I/home/cyapp/brlcad-7.25.0/include -isystem /home/cyapp/brlcad-7.25.0/build/src/other/tcl/include -isystem /home/cyapp/brlcad-7.25.0/build/src/other/openNURBS -isystem /home/cyapp/brlcad-7.25.0/build/src/other/libz -isystem /home/cyapp/brlcad-7.25.0/src/other/tcl/generic -isystem /home/cyapp/brlcad-7.25.0/src/other/tcl/libtommath -isystem /home/cyapp/brlcad-7.25.0/src/other/tcl/unix -isystem /home/cyapp/brlcad-7.25.0/src/other/tk/generic -isystem /home/cyapp/brlcad-7.25.0/src/other/openNURBS -isystem /home/cyapp/brlcad-7.25.0/src/other/libz -isystem /home/cyapp/brlcad-7.25.0/src/other/poly2tri -I/home/cyapp/brlcad-7.25.0/src/libgcv/plugins/obj -I/home/cyapp/brlcad-7.25.0/src/libgcv/plugins/obj/wfobj -I/home/cyapp/brlcad-7.25.0/build/src/libgcv/plugins/obj/wfobj  -pipe -fno-strict-aliasing -fno-common -fexceptions -std=gnu89 -m64 -g -ggdb3 -fstack-protector-all -pedantic -pedantic-errors -Wall -Wextra -Wundef -Wfloat-equal -Wshadow -Wbad-function-cast -Wdeclaration-after-statement -Wc++-compat -Winline -Wno-long-long -Wno-variadic-macros -Werror -fPIC   -o CMakeFiles/libgcv_obj.dir/obj_read.c.o   -c /home/cyapp/brlcad-7.25.0/src/libgcv/plugins/obj/obj_read.c (continuing)
make: don't know how to make lib/libwfobj.so.20.0(continuing)
Build for lib/libgcv_plugins/libgcv_obj.so aborted
Build for src/libgcv/plugins/obj/CMakeFiles/libgcv_obj.dir/build aborted
`src/libgcv/plugins/obj/CMakeFiles/libgcv_obj.dir/build' not remade because of errors.
[ 69%] Built target libgcv_obj
[ 69%] Built target archer_images_cp
[ 69%] Built target bntester
[ 70%] Built target tester_bn_plane_pt
[ 70%] Built target doc_legal_cp
[ 70%] Built target minigzip
[ 70%] Built target test_bu_hash
[ 70%] Built target test_bu_opt
[ 70%] Built target test_bu_booleanize
[ 70%] Built target brlman_tcl_cp
[ 71%] Built target Tkhtml
make: don't know how to make lib/libtclcad.so.20.0 (prerequisite of: bin/brlman)(continuing)
make: don't know how to make lib/libged.so.20.0(continuing)
Build for bin/brlman aborted
Build for src/brlman/CMakeFiles/brlman.dir/build aborted
`src/brlman/CMakeFiles/brlman.dir/build' not remade because of errors.
[ 71%] Built target brlman
[ 71%] Built target archer_launch_tcl_cp
[ 71%] Built target 7dd9466c76c9a7e2eaf6b83476fbe31f_cp
[ 71%] Built target stl-g
[ 71%] Built target g-euclid1
[ 71%] Built target g-acad
[ 71%] Built target g-xxx
[ 71%] Built target patch-g
[ 71%] Built target ply-g
make: don't know how to make bin/asc2g (prerequisite of: share/db/havoc.g)(continuing)
Build for share/db/havoc.g aborted
Build for db/CMakeFiles/havoc.g aborted
Build for havoc.g aborted
Build for db/CMakeFiles/havoc.g.dir/build aborted
`db/CMakeFiles/havoc.g.dir/build' not remade because of errors.
[ 71%] Built target havoc.g
make: don't know how to make bin/asc2g (prerequisite of: share/db/pinewood.g)(continuing)
Build for share/db/pinewood.g aborted
Build for db/CMakeFiles/pinewood.g aborted
Build for pinewood.g aborted
Build for db/CMakeFiles/pinewood.g.dir/build aborted
`db/CMakeFiles/pinewood.g.dir/build' not remade because of errors.
[ 71%] Built target pinewood.g
make: don't know how to make bin/asc2g (prerequisite of: share/db/axis.g)(continuing)
Build for share/db/axis.g aborted
Build for db/CMakeFiles/axis.g aborted
Build for axis.g aborted
Build for db/CMakeFiles/axis.g.dir/build aborted
`db/CMakeFiles/axis.g.dir/build' not remade because of errors.
[ 71%] Built target axis.g
[ 71%] Built target cadwidgets_HTML_cp
[ 71%] Built target profont_ProFont_ttf_cp
[ 71%] Built target fortran_example_f_cp
[ 71%] Built target pictx
[ 71%] Built target shapefact
make: don't know how to make bin/asc2g (prerequisite of: share/db/bldg391.g)(continuing)
Build for share/db/bldg391.g aborted
Build for db/CMakeFiles/bldg391.g aborted
Build for bldg391.g aborted
Build for db/CMakeFiles/bldg391.g.dir/build aborted
`db/CMakeFiles/bldg391.g.dir/build' not remade because of errors.
[ 71%] Built target bldg391.g
make: don't know how to make bin/asc2g (prerequisite of: share/db/demo.g)(continuing)
Build for share/db/demo.g aborted
Build for db/CMakeFiles/demo.g aborted
Build for demo.g aborted
Build for db/CMakeFiles/demo.g.dir/build aborted
`db/CMakeFiles/demo.g.dir/build' not remade because of errors.
[ 71%] Built target demo.g
make: don't know how to make bin/asc2g (prerequisite of: share/db/xmp.g)(continuing)
Build for share/db/xmp.g aborted
Build for db/CMakeFiles/xmp.g aborted
Build for xmp.g aborted
Build for db/CMakeFiles/xmp.g.dir/build aborted
`db/CMakeFiles/xmp.g.dir/build' not remade because of errors.
[ 71%] Built target xmp.g
[ 71%] Built target plot3-asc
[ 71%] Built target roots_example
[ 71%] Built target pixcolors
[ 71%] Built target pixrot
[ 72%] Built target astyle
make: don't know how to make bin/step-g (prerequisite of: share/db/NIST_MBE_PMI_1.g)(continuing)
Build for share/db/NIST_MBE_PMI_1.g aborted
Build for db/nist/CMakeFiles/NIST_MBE_PMI_1.g aborted
Build for NIST_MBE_PMI_1.g aborted
Build for db/nist/CMakeFiles/NIST_MBE_PMI_1.g.dir/build aborted
`db/nist/CMakeFiles/NIST_MBE_PMI_1.g.dir/build' not remade because of errors.
[ 72%] Built target NIST_MBE_PMI_1.g
[ 72%] Built target csg
[ 72%] Built target g-vrml
[ 72%] Built target g-nff
[ 72%] Built target g-x3d
[ 72%] Built target script-tab
[ 72%] Built target bg_tri_tri_isect_coplanar
[ 72%] Built target bg_obr
[ 72%] Built target bg_chull3d
[ 72%] �[32m�[1mLinking C executable ../../bin/fbserv�[0m
/usr/bin/ld: cannot find -llibfreetype.so.6
collect2: ld returned 1 exit status
*** Error 1 in target 'bin/fbserv', line 145 of src/fbserv/CMakeFiles/fbserv.dir/build.make (continuing)
Build for src/fbserv/CMakeFiles/fbserv.dir/build aborted
`src/fbserv/CMakeFiles/fbserv.dir/build' not remade because of errors.
[ 72%] Built target fbserv
[ 72%] Built target g-xxx_facets_c_cp
[ 72%] Built target dem-g
[ 72%] Built target d-a
[ 72%] Built target d-u
[ 72%] Built target d-i
[ 72%] Built target PictureTypeA_DATA_cp
[ 72%] Built target chan_permute
[ 72%] Built target anim_lookat
[ 72%] Built target anim_track
[ 72%] Built target anim_sort
[ 73%] Built target png16_static
[ 73%] Built target secpass
[ 73%] Built target ir-X
[ 73%] Built target swidgets_image_DATA_cp
[ 73%] Built target itkstub
[ 73%] Built target relnotes_HTML_cp
[ 73%] Built target manuals_shaders_camo_html_cp
[ 73%] Built target steplazyfile
[ 73%] Built target lazy_test
[ 73%] �[32m�[1mLinking C executable ../../bin/fbscanplot�[0m
/usr/bin/ld: cannot find -llibfreetype.so.6
collect2: ld returned 1 exit status
*** Error 1 in target 'bin/fbscanplot', line 119 of src/fb/CMakeFiles/fbscanplot.dir/build.make (continuing)
Build for src/fb/CMakeFiles/fbscanplot.dir/build aborted
`src/fb/CMakeFiles/fbscanplot.dir/build' not remade because of errors.
[ 73%] Built target fbscanplot
[ 73%] �[32m�[1mLinking C executable ../../bin/polar-fb�[0m
/usr/bin/ld: cannot find -llibfreetype.so.6
collect2: ld returned 1 exit status
*** Error 1 in target 'bin/polar-fb', line 119 of src/fb/CMakeFiles/polar-fb.dir/build.make (continuing)
Build for src/fb/CMakeFiles/polar-fb.dir/build aborted
`src/fb/CMakeFiles/polar-fb.dir/build' not remade because of errors.
[ 73%] Built target polar-fb
[ 73%] �[32m�[1mLinking C executable ../../bin/fbline�[0m
/usr/bin/ld: cannot find -llibfreetype.so.6
collect2: ld returned 1 exit status
*** Error 1 in target 'bin/fbline', line 119 of src/fb/CMakeFiles/fbline.dir/build.make (continuing)
Build for src/fb/CMakeFiles/fbline.dir/build aborted
`src/fb/CMakeFiles/fbline.dir/build' not remade because of errors.
[ 73%] Built target fbline
[ 73%] �[32m�[1mLinking C executable ../../bin/fb-fb�[0m
/usr/bin/ld: cannot find -llibfreetype.so.6
collect2: ld returned 1 exit status
*** Error 1 in target 'bin/fb-fb', line 119 of src/fb/CMakeFiles/fb-fb.dir/build.make (continuing)
Build for src/fb/CMakeFiles/fb-fb.dir/build aborted
`src/fb/CMakeFiles/fb-fb.dir/build' not remade because of errors.
[ 73%] Built target fb-fb
[ 73%] �[32mBuilding C object src/shapes/CMakeFiles/wire.dir/wire.c.o�[0m
cc1: warnings being treated as errors
/home/cyapp/brlcad-7.25.0/src/shapes/wire.c: In function 'main':
/home/cyapp/brlcad-7.25.0/src/shapes/wire.c:149: warning: Array size (26) smaller than format string size (27) (arg 2)
*** Error 1 in target 'src/shapes/CMakeFiles/wire.dir/wire.c.o', line 63 of src/shapes/CMakeFiles/wire.dir/build.make: cd /home/cyapp/brlcad-7.25.0/build/src/shapes && /usr/bin/cc  -DBRLCADBUILD=1 -DHAVE_CONFIG_H -DOBJ_BREP=1 -I/home/cyapp/brlcad-7.25.0/build/include -I/home/cyapp/brlcad-7.25.0/include -I/home/cyapp/brlcad-7.25.0/src/other/tcl/generic -I/home/cyapp/brlcad-7.25.0/src/other/tcl/libtommath -I/home/cyapp/brlcad-7.25.0/build/src/other/tcl/include -I/home/cyapp/brlcad-7.25.0/src/other/tcl/unix -I/home/cyapp/brlcad-7.25.0/src/other/tk/generic -I/home/cyapp/brlcad-7.25.0/src/other/openNURBS -I/home/cyapp/brlcad-7.25.0/build/src/other/openNURBS -I/home/cyapp/brlcad-7.25.0/src/other/libz -I/home/cyapp/brlcad-7.25.0/build/src/other/libz -I/home/cyapp/brlcad-7.25.0/src/other/poly2tri -I/home/cyapp/brlcad-7.25.0/src/shapes  -pipe -fno-strict-aliasing -fno-common -fexceptions -std=gnu89 -m64 -g -ggdb3 -fstack-protector-all -pedantic -pedantic-errors -Wall -Wextra -Wundef -Wfloat-equal -Wshadow -Wbad-function-cast -Wdeclaration-after-statement -Wc++-compat -Winline -Wno-long-long -Wno-variadic-macros -Werror   -o CMakeFiles/wire.dir/wire.c.o   -c /home/cyapp/brlcad-7.25.0/src/shapes/wire.c (continuing)
Build for bin/wire aborted
Build for src/shapes/CMakeFiles/wire.dir/build aborted
`src/shapes/CMakeFiles/wire.dir/build' not remade because of errors.
[ 73%] Built target wire
[ 73%] Built target cad_parea
[ 73%] Built target tester_bn_list
[ 73%] Built target tester_bn_tabdata
[ 73%] �[32m�[1mLinking C executable ../../bin/fbgamma�[0m
/usr/bin/ld: cannot find -llibfreetype.so.6
collect2: ld returned 1 exit status
*** Error 1 in target 'bin/fbgamma', line 119 of src/fb/CMakeFiles/fbgamma.dir/build.make (continuing)
Build for src/fb/CMakeFiles/fbgamma.dir/build aborted
`src/fb/CMakeFiles/fbgamma.dir/build' not remade because of errors.
[ 73%] Built target fbgamma
[ 73%] �[32m�[1mLinking C executable ../../bin/pixautosize�[0m
/usr/bin/ld: cannot find -llibfreetype.so.6
collect2: ld returned 1 exit status
*** Error 1 in target 'bin/pixautosize', line 119 of src/fb/CMakeFiles/pixautosize.dir/build.make (continuing)
Build for src/fb/CMakeFiles/pixautosize.dir/build aborted
`src/fb/CMakeFiles/pixautosize.dir/build' not remade because of errors.
[ 73%] Built target pixautosize
[ 73%] �[32m�[1mLinking C executable ../../bin/gif2fb�[0m
/usr/bin/ld: cannot find -llibfreetype.so.6
collect2: ld returned 1 exit status
*** Error 1 in target 'bin/gif2fb', line 119 of src/fb/CMakeFiles/gif2fb.dir/build.make (continuing)
Build for src/fb/CMakeFiles/gif2fb.dir/build aborted
`src/fb/CMakeFiles/gif2fb.dir/build' not remade because of errors.
[ 73%] Built target gif2fb
[ 73%] Built target pixcount
[ 73%] Built target bwfilter
[ 73%] �[32m�[1mLinking C executable ../../bin/pix-yuv�[0m
/usr/bin/ld: cannot find -llibfreetype.so.6
collect2: ld returned 1 exit status
*** Error 1 in target 'bin/pix-yuv', line 120 of src/util/CMakeFiles/pix-yuv.dir/build.make (continuing)
Build for src/util/CMakeFiles/pix-yuv.dir/build aborted
`src/util/CMakeFiles/pix-yuv.dir/build' not remade because of errors.
[ 73%] Built target pix-yuv
[ 74%] Built target pixclump
[ 74%] Built target icv
[ 74%] Built target pixstat
[ 74%] Built target loop
[ 74%] Built target bwstat
[ 74%] Built target test_bu_basename
[ 74%] Built target test_bu_vls
[ 74%] Built target test_bu_parallel
[ 74%] Built target test_bu_sort
[ 74%] Built target pix-sun
[ 74%] Built target alias-pix
[ 74%] Built target hex
[ 74%] Built target plot3getframe
[ 79%] Built target docbook-docbook-system-man1
[ 79%] Built target masonry
[ 79%] Built target brep_cobb
[ 79%] Built target tea
[ 79%] Built target toplevel_DOCFILES_cp
[ 79%] �[32mBuilding C object src/shapes/CMakeFiles/window_frame.dir/window_frame.c.o�[0m
cc1: warnings being treated as errors
/home/cyapp/brlcad-7.25.0/src/shapes/window_frame.c: In function 'main':
/home/cyapp/brlcad-7.25.0/src/shapes/window_frame.c:113: warning: Array size (26) smaller than format string size (27) (arg 2)
*** Error 1 in target 'src/shapes/CMakeFiles/window_frame.dir/window_frame.c.o', line 63 of src/shapes/CMakeFiles/window_frame.dir/build.make: cd /home/cyapp/brlcad-7.25.0/build/src/shapes && /usr/bin/cc  -DBRLCADBUILD=1 -DHAVE_CONFIG_H -DOBJ_BREP=1 -I/home/cyapp/brlcad-7.25.0/build/include -I/home/cyapp/brlcad-7.25.0/include -I/home/cyapp/brlcad-7.25.0/src/other/tcl/generic -I/home/cyapp/brlcad-7.25.0/src/other/tcl/libtommath -I/home/cyapp/brlcad-7.25.0/build/src/other/tcl/include -I/home/cyapp/brlcad-7.25.0/src/other/tcl/unix -I/home/cyapp/brlcad-7.25.0/src/other/tk/generic -I/home/cyapp/brlcad-7.25.0/src/other/openNURBS -I/home/cyapp/brlcad-7.25.0/build/src/other/openNURBS -I/home/cyapp/brlcad-7.25.0/src/other/libz -I/home/cyapp/brlcad-7.25.0/build/src/other/libz -I/home/cyapp/brlcad-7.25.0/src/other/poly2tri -I/home/cyapp/brlcad-7.25.0/src/shapes  -pipe -fno-strict-aliasing -fno-common -fexceptions -std=gnu89 -m64 -g -ggdb3 -fstack-protector-all -pedantic -pedantic-errors -Wall -Wextra -Wundef -Wfloat-equal -Wshadow -Wbad-function-cast -Wdeclaration-after-statement -Wc++-compat -Winline -Wno-long-long -Wno-variadic-macros -Werror   -o CMakeFiles/window_frame.dir/window_frame.c.o   -c /home/cyapp/brlcad-7.25.0/src/shapes/window_frame.c (continuing)
Build for bin/window_frame aborted
Build for src/shapes/CMakeFiles/window_frame.dir/build aborted
`src/shapes/CMakeFiles/window_frame.dir/build' not remade because of errors.
[ 79%] Built target window_frame
[ 79%] �[32mBuilding C object src/rt/CMakeFiles/rtcheck.dir/do.c.o�[0m
cc1: warnings being treated as errors
/home/cyapp/brlcad-7.25.0/src/rt/do.c: In function 'old_frame':
/home/cyapp/brlcad-7.25.0/src/rt/do.c:96: warning: Array size (128) smaller than format string size (129) (arg 3)
/home/cyapp/brlcad-7.25.0/src/rt/do.c:98: warning: Array size (128) smaller than format string size (129) (arg 3)
/home/cyapp/brlcad-7.25.0/src/rt/do.c:100: warning: Array size (128) smaller than format string size (129) (arg 3)
/home/cyapp/brlcad-7.25.0/src/rt/do.c:102: warning: Array size (128) smaller than format string size (129) (arg 3)
/home/cyapp/brlcad-7.25.0/src/rt/do.c:105: warning: Array size (128) smaller than format string size (129) (arg 3)
*** Error 1 in target 'src/rt/CMakeFiles/rtcheck.dir/do.c.o', line 63 of src/rt/CMakeFiles/rtcheck.dir/build.make: cd /home/cyapp/brlcad-7.25.0/build/src/rt && /usr/bin/cc  -DBRLCADBUILD=1 -DHAVE_CONFIG_H -I/home/cyapp/brlcad-7.25.0/build/include -I/home/cyapp/brlcad-7.25.0/include -I/home/cyapp/brlcad-7.25.0/src/other/tcl/generic -I/home/cyapp/brlcad-7.25.0/src/other/tcl/libtommath -I/home/cyapp/brlcad-7.25.0/build/src/other/tcl/include -I/home/cyapp/brlcad-7.25.0/src/other/tcl/unix -I/home/cyapp/brlcad-7.25.0/src/other/tk/generic -I/home/cyapp/brlcad-7.25.0/src/other/openNURBS -I/home/cyapp/brlcad-7.25.0/build/src/other/openNURBS -I/home/cyapp/brlcad-7.25.0/src/other/libz -I/home/cyapp/brlcad-7.25.0/build/src/other/libz -I/home/cyapp/brlcad-7.25.0/src/other/poly2tri -I/usr/X11R6/include -I/home/cyapp/brlcad-7.25.0/src/rt  -pipe -fno-strict-aliasing -fno-common -fexceptions -std=gnu89 -m64 -g -ggdb3 -fstack-protector-all -pedantic -pedantic-errors -Wall -Wextra -Wundef -Wfloat-equal -Wshadow -Wbad-function-cast -Wdeclaration-after-statement -Wc++-compat -Winline -Wno-long-long -Wno-variadic-macros -Werror   -o CMakeFiles/rtcheck.dir/do.c.o   -c /home/cyapp/brlcad-7.25.0/src/rt/do.c (continuing)
Build for bin/rtcheck aborted
Build for src/rt/CMakeFiles/rtcheck.dir/build aborted
`src/rt/CMakeFiles/rtcheck.dir/build' not remade because of errors.
[ 79%] Built target rtcheck
[ 79%] �[32mBuilding C object src/rt/CMakeFiles/rt_bot_faces.dir/do.c.o�[0m
cc1: warnings being treated as errors
/home/cyapp/brlcad-7.25.0/src/rt/do.c: In function 'old_frame':
/home/cyapp/brlcad-7.25.0/src/rt/do.c:96: warning: Array size (128) smaller than format string size (129) (arg 3)
/home/cyapp/brlcad-7.25.0/src/rt/do.c:98: warning: Array size (128) smaller than format string size (129) (arg 3)
/home/cyapp/brlcad-7.25.0/src/rt/do.c:100: warning: Array size (128) smaller than format string size (129) (arg 3)
/home/cyapp/brlcad-7.25.0/src/rt/do.c:102: warning: Array size (128) smaller than format string size (129) (arg 3)
/home/cyapp/brlcad-7.25.0/src/rt/do.c:105: warning: Array size (128) smaller than format string size (129) (arg 3)
*** Error 1 in target 'src/rt/CMakeFiles/rt_bot_faces.dir/do.c.o', line 63 of src/rt/CMakeFiles/rt_bot_faces.dir/build.make: cd /home/cyapp/brlcad-7.25.0/build/src/rt && /usr/bin/cc  -DBRLCADBUILD=1 -DHAVE_CONFIG_H -I/home/cyapp/brlcad-7.25.0/build/include -I/home/cyapp/brlcad-7.25.0/include -I/home/cyapp/brlcad-7.25.0/src/other/tcl/generic -I/home/cyapp/brlcad-7.25.0/src/other/tcl/libtommath -I/home/cyapp/brlcad-7.25.0/build/src/other/tcl/include -I/home/cyapp/brlcad-7.25.0/src/other/tcl/unix -I/home/cyapp/brlcad-7.25.0/src/other/tk/generic -I/home/cyapp/brlcad-7.25.0/src/other/openNURBS -I/home/cyapp/brlcad-7.25.0/build/src/other/openNURBS -I/home/cyapp/brlcad-7.25.0/src/other/libz -I/home/cyapp/brlcad-7.25.0/build/src/other/libz -I/home/cyapp/brlcad-7.25.0/src/other/poly2tri -I/usr/X11R6/include -I/home/cyapp/brlcad-7.25.0/src/rt  -pipe -fno-strict-aliasing -fno-common -fexceptions -std=gnu89 -m64 -g -ggdb3 -fstack-protector-all -pedantic -pedantic-errors -Wall -Wextra -Wundef -Wfloat-equal -Wshadow -Wbad-function-cast -Wdeclaration-after-statement -Wc++-compat -Winline -Wno-long-long -Wno-variadic-macros -Werror   -o CMakeFiles/rt_bot_faces.dir/do.c.o   -c /home/cyapp/brlcad-7.25.0/src/rt/do.c (continuing)
Build for bin/rt_bot_faces aborted
Build for src/rt/CMakeFiles/rt_bot_faces.dir/build aborted
`src/rt/CMakeFiles/rt_bot_faces.dir/build' not remade because of errors.
[ 79%] Built target rt_bot_faces
[ 79%] Built target termlib-static
[ 79%] �[32mBuilding C object src/rt/CMakeFiles/rtpp.dir/do.c.o�[0m
cc1: warnings being treated as errors
/home/cyapp/brlcad-7.25.0/src/rt/do.c: In function 'old_frame':
/home/cyapp/brlcad-7.25.0/src/rt/do.c:96: warning: Array size (128) smaller than format string size (129) (arg 3)
/home/cyapp/brlcad-7.25.0/src/rt/do.c:98: warning: Array size (128) smaller than format string size (129) (arg 3)
/home/cyapp/brlcad-7.25.0/src/rt/do.c:100: warning: Array size (128) smaller than format string size (129) (arg 3)
/home/cyapp/brlcad-7.25.0/src/rt/do.c:102: warning: Array size (128) smaller than format string size (129) (arg 3)
/home/cyapp/brlcad-7.25.0/src/rt/do.c:105: warning: Array size (128) smaller than format string size (129) (arg 3)
*** Error 1 in target 'src/rt/CMakeFiles/rtpp.dir/do.c.o', line 63 of src/rt/CMakeFiles/rtpp.dir/build.make: cd /home/cyapp/brlcad-7.25.0/build/src/rt && /usr/bin/cc  -DBRLCADBUILD=1 -DHAVE_CONFIG_H -I/home/cyapp/brlcad-7.25.0/build/include -I/home/cyapp/brlcad-7.25.0/include -I/home/cyapp/brlcad-7.25.0/src/other/tcl/generic -I/home/cyapp/brlcad-7.25.0/src/other/tcl/libtommath -I/home/cyapp/brlcad-7.25.0/build/src/other/tcl/include -I/home/cyapp/brlcad-7.25.0/src/other/tcl/unix -I/home/cyapp/brlcad-7.25.0/src/other/tk/generic -I/home/cyapp/brlcad-7.25.0/src/other/openNURBS -I/home/cyapp/brlcad-7.25.0/build/src/other/openNURBS -I/home/cyapp/brlcad-7.25.0/src/other/libz -I/home/cyapp/brlcad-7.25.0/build/src/other/libz -I/home/cyapp/brlcad-7.25.0/src/other/poly2tri -I/usr/X11R6/include -I/home/cyapp/brlcad-7.25.0/src/rt  -pipe -fno-strict-aliasing -fno-common -fexceptions -std=gnu89 -m64 -g -ggdb3 -fstack-protector-all -pedantic -pedantic-errors -Wall -Wextra -Wundef -Wfloat-equal -Wshadow -Wbad-function-cast -Wdeclaration-after-statement -Wc++-compat -Winline -Wno-long-long -Wno-variadic-macros -Werror   -o CMakeFiles/rtpp.dir/do.c.o   -c /home/cyapp/brlcad-7.25.0/src/rt/do.c (continuing)
Build for bin/rtpp aborted
Build for src/rt/CMakeFiles/rtpp.dir/build aborted
`src/rt/CMakeFiles/rtpp.dir/build' not remade because of errors.
[ 79%] Built target rtpp
[ 79%] �[32mBuilding C object src/rt/CMakeFiles/rtarea.dir/do.c.o�[0m
cc1: warnings being treated as errors
/home/cyapp/brlcad-7.25.0/src/rt/do.c: In function 'old_frame':
/home/cyapp/brlcad-7.25.0/src/rt/do.c:96: warning: Array size (128) smaller than format string size (129) (arg 3)
/home/cyapp/brlcad-7.25.0/src/rt/do.c:98: warning: Array size (128) smaller than format string size (129) (arg 3)
/home/cyapp/brlcad-7.25.0/src/rt/do.c:100: warning: Array size (128) smaller than format string size (129) (arg 3)
/home/cyapp/brlcad-7.25.0/src/rt/do.c:102: warning: Array size (128) smaller than format string size (129) (arg 3)
/home/cyapp/brlcad-7.25.0/src/rt/do.c:105: warning: Array size (128) smaller than format string size (129) (arg 3)
*** Error 1 in target 'src/rt/CMakeFiles/rtarea.dir/do.c.o', line 63 of src/rt/CMakeFiles/rtarea.dir/build.make: cd /home/cyapp/brlcad-7.25.0/build/src/rt && /usr/bin/cc  -DBRLCADBUILD=1 -DHAVE_CONFIG_H -I/home/cyapp/brlcad-7.25.0/build/include -I/home/cyapp/brlcad-7.25.0/include -I/home/cyapp/brlcad-7.25.0/src/other/tcl/generic -I/home/cyapp/brlcad-7.25.0/src/other/tcl/libtommath -I/home/cyapp/brlcad-7.25.0/build/src/other/tcl/include -I/home/cyapp/brlcad-7.25.0/src/other/tcl/unix -I/home/cyapp/brlcad-7.25.0/src/other/tk/generic -I/home/cyapp/brlcad-7.25.0/src/other/openNURBS -I/home/cyapp/brlcad-7.25.0/build/src/other/openNURBS -I/home/cyapp/brlcad-7.25.0/src/other/libz -I/home/cyapp/brlcad-7.25.0/build/src/other/libz -I/home/cyapp/brlcad-7.25.0/src/other/poly2tri -I/usr/X11R6/include -I/home/cyapp/brlcad-7.25.0/src/rt  -pipe -fno-strict-aliasing -fno-common -fexceptions -std=gnu89 -m64 -g -ggdb3 -fstack-protector-all -pedantic -pedantic-errors -Wall -Wextra -Wundef -Wfloat-equal -Wshadow -Wbad-function-cast -Wdeclaration-after-statement -Wc++-compat -Winline -Wno-long-long -Wno-variadic-macros -Werror   -o CMakeFiles/rtarea.dir/do.c.o   -c /home/cyapp/brlcad-7.25.0/src/rt/do.c (continuing)
Build for bin/rtarea aborted
Build for src/rt/CMakeFiles/rtarea.dir/build aborted
`src/rt/CMakeFiles/rtarea.dir/build' not remade because of errors.
[ 79%] Built target rtarea
[ 79%] �[32m�[1mLinking C executable ../../bin/rtwalk�[0m
/usr/bin/ld: cannot find -llibfreetype.so.6
collect2: ld returned 1 exit status
*** Error 1 in target 'bin/rtwalk', line 132 of src/rt/CMakeFiles/rtwalk.dir/build.make (continuing)
Build for src/rt/CMakeFiles/rtwalk.dir/build aborted
`src/rt/CMakeFiles/rtwalk.dir/build' not remade because of errors.
[ 79%] Built target rtwalk
[ 79%] Built target naca456
[ 79%] �[32m�[1mLinking C executable ../../bin/fbzoom�[0m
/usr/bin/ld: cannot find -llibfreetype.so.6
collect2: ld returned 1 exit status
*** Error 1 in target 'bin/fbzoom', line 121 of src/fb/CMakeFiles/fbzoom.dir/build.make (continuing)
Build for src/fb/CMakeFiles/fbzoom.dir/build aborted
`src/fb/CMakeFiles/fbzoom.dir/build' not remade because of errors.
[ 80%] Built target fbzoom
[ 80%] �[32m�[1mLinking C executable ../../bin/fbcbars�[0m
/usr/bin/ld: cannot find -llibfreetype.so.6
collect2: ld returned 1 exit status
*** Error 1 in target 'bin/fbcbars', line 119 of src/fb/CMakeFiles/fbcbars.dir/build.make (continuing)
Build for src/fb/CMakeFiles/fbcbars.dir/build aborted
`src/fb/CMakeFiles/fbcbars.dir/build' not remade because of errors.
[ 80%] Built target fbcbars
[ 80%] �[32m�[1mLinking C executable ../../bin/fblabel�[0m
/usr/bin/ld: cannot find -llibfreetype.so.6
collect2: ld returned 1 exit status
*** Error 1 in target 'bin/fblabel', line 119 of src/fb/CMakeFiles/fblabel.dir/build.make (continuing)
Build for src/fb/CMakeFiles/fblabel.dir/build aborted
`src/fb/CMakeFiles/fblabel.dir/build' not remade because of errors.
[ 80%] Built target fblabel
[ 80%] �[32m�[1mLinking C executable ../../bin/fbcmrot�[0m
/usr/bin/ld: cannot find -llibfreetype.so.6
collect2: ld returned 1 exit status
*** Error 1 in target 'bin/fbcmrot', line 119 of src/fb/CMakeFiles/fbcmrot.dir/build.make (continuing)
Build for src/fb/CMakeFiles/fbcmrot.dir/build aborted
`src/fb/CMakeFiles/fbcmrot.dir/build' not remade because of errors.
[ 80%] Built target fbcmrot
[ 80%] Built target all_sf
[ 80%] Built target gen-attributes-file
[ 80%] Built target attr_std_table_xml
[ 80%] Built target attr_std_list_xml
[ 80%] Built target docbook-docbook-system-man5
[ 80%] Built target lowp
[ 80%] Built target plot3stat
make: don't know how to make bin/step-g (prerequisite of: share/db/NIST_MBE_PMI_4.g)(continuing)
Build for share/db/NIST_MBE_PMI_4.g aborted
Build for db/nist/CMakeFiles/NIST_MBE_PMI_4.g aborted
Build for NIST_MBE_PMI_4.g aborted
Build for db/nist/CMakeFiles/NIST_MBE_PMI_4.g.dir/build aborted
`db/nist/CMakeFiles/NIST_MBE_PMI_4.g.dir/build' not remade because of errors.
[ 80%] Built target NIST_MBE_PMI_4.g
make: don't know how to make bin/step-g (prerequisite of: share/db/NIST_MBE_PMI_3.g)(continuing)
Build for share/db/NIST_MBE_PMI_3.g aborted
Build for db/nist/CMakeFiles/NIST_MBE_PMI_3.g aborted
Build for NIST_MBE_PMI_3.g aborted
Build for db/nist/CMakeFiles/NIST_MBE_PMI_3.g.dir/build aborted
`db/nist/CMakeFiles/NIST_MBE_PMI_3.g.dir/build' not remade because of errors.
[ 80%] Built target NIST_MBE_PMI_3.g
[ 80%] �[32m�[1mLinking C executable ../../bin/fbanim�[0m
/usr/bin/ld: cannot find -llibfreetype.so.6
collect2: ld returned 1 exit status
*** Error 1 in target 'bin/fbanim', line 119 of src/fb/CMakeFiles/fbanim.dir/build.make (continuing)
Build for src/fb/CMakeFiles/fbanim.dir/build aborted
`src/fb/CMakeFiles/fbanim.dir/build' not remade because of errors.
[ 80%] Built target fbanim
[ 80%] �[32m�[1mLinking C executable ../../bin/fbpoint�[0m
/usr/bin/ld: cannot find -llibfreetype.so.6
collect2: ld returned 1 exit status
*** Error 1 in target 'bin/fbpoint', line 121 of src/fb/CMakeFiles/fbpoint.dir/build.make (continuing)
Build for src/fb/CMakeFiles/fbpoint.dir/build aborted
`src/fb/CMakeFiles/fbpoint.dir/build' not remade because of errors.
[ 80%] Built target fbpoint
[ 80%] �[32m�[1mLinking C shared library ../../../lib/libTktable.so�[0m
/usr/bin/ld: cannot find -llibfreetype.so.6
collect2: ld returned 1 exit status
*** Error 1 in target 'lib/libTktable.so.2.10', line 291 of src/other/tktable/CMakeFiles/Tktable.dir/build.make (continuing)
Build for lib/libTktable.so aborted
Build for src/other/tktable/CMakeFiles/Tktable.dir/build aborted
`src/other/tktable/CMakeFiles/Tktable.dir/build' not remade because of errors.
[ 80%] Built target Tktable
[ 80%] �[32m�[1mLinking C executable ../../bin/fbclear�[0m
/usr/bin/ld: cannot find -llibfreetype.so.6
collect2: ld returned 1 exit status
*** Error 1 in target 'bin/fbclear', line 119 of src/fb/CMakeFiles/fbclear.dir/build.make (continuing)
Build for src/fb/CMakeFiles/fbclear.dir/build aborted
`src/fb/CMakeFiles/fbclear.dir/build' not remade because of errors.
[ 80%] Built target fbclear
[ 80%] �[32m�[1mLinking C executable ../../bin/fbfree�[0m
/usr/bin/ld: cannot find -llibfreetype.so.6
collect2: ld returned 1 exit status
*** Error 1 in target 'bin/fbfree', line 119 of src/fb/CMakeFiles/fbfree.dir/build.make (continuing)
Build for src/fb/CMakeFiles/fbfree.dir/build aborted
`src/fb/CMakeFiles/fbfree.dir/build' not remade because of errors.
[ 80%] Built target fbfree
[ 81%] Built target bwmod
[ 81%] Built target pix-bw
[ 81%] Built target pixmatte
[ 81%] �[32mBuilding C object src/rt/CMakeFiles/rtedge.dir/do.c.o�[0m
cc1: warnings being treated as errors
/home/cyapp/brlcad-7.25.0/src/rt/do.c: In function 'old_frame':
/home/cyapp/brlcad-7.25.0/src/rt/do.c:96: warning: Array size (128) smaller than format string size (129) (arg 3)
/home/cyapp/brlcad-7.25.0/src/rt/do.c:98: warning: Array size (128) smaller than format string size (129) (arg 3)
/home/cyapp/brlcad-7.25.0/src/rt/do.c:100: warning: Array size (128) smaller than format string size (129) (arg 3)
/home/cyapp/brlcad-7.25.0/src/rt/do.c:102: warning: Array size (128) smaller than format string size (129) (arg 3)
/home/cyapp/brlcad-7.25.0/src/rt/do.c:105: warning: Array size (128) smaller than format string size (129) (arg 3)
*** Error 1 in target 'src/rt/CMakeFiles/rtedge.dir/do.c.o', line 63 of src/rt/CMakeFiles/rtedge.dir/build.make: cd /home/cyapp/brlcad-7.25.0/build/src/rt && /usr/bin/cc  -DBRLCADBUILD=1 -DHAVE_CONFIG_H -I/home/cyapp/brlcad-7.25.0/build/include -I/home/cyapp/brlcad-7.25.0/include -I/home/cyapp/brlcad-7.25.0/src/other/tcl/generic -I/home/cyapp/brlcad-7.25.0/src/other/tcl/libtommath -I/home/cyapp/brlcad-7.25.0/build/src/other/tcl/include -I/home/cyapp/brlcad-7.25.0/src/other/tcl/unix -I/home/cyapp/brlcad-7.25.0/src/other/tk/generic -I/home/cyapp/brlcad-7.25.0/src/other/openNURBS -I/home/cyapp/brlcad-7.25.0/build/src/other/openNURBS -I/home/cyapp/brlcad-7.25.0/src/other/libz -I/home/cyapp/brlcad-7.25.0/build/src/other/libz -I/home/cyapp/brlcad-7.25.0/src/other/poly2tri -I/usr/X11R6/include -I/home/cyapp/brlcad-7.25.0/src/rt  -pipe -fno-strict-aliasing -fno-common -fexceptions -std=gnu89 -m64 -g -ggdb3 -fstack-protector-all -pedantic -pedantic-errors -Wall -Wextra -Wundef -Wfloat-equal -Wshadow -Wbad-function-cast -Wdeclaration-after-statement -Wc++-compat -Winline -Wno-long-long -Wno-variadic-macros -Werror   -o CMakeFiles/rtedge.dir/do.c.o   -c /home/cyapp/brlcad-7.25.0/src/rt/do.c (continuing)
Build for bin/rtedge aborted
Build for src/rt/CMakeFiles/rtedge.dir/build aborted
`src/rt/CMakeFiles/rtedge.dir/build' not remade because of errors.
[ 81%] Built target rtedge
[ 81%] �[32m�[1mLinking C executable ../../bin/pix-fb�[0m
/usr/bin/ld: cannot find -llibfreetype.so.6
collect2: ld returned 1 exit status
*** Error 1 in target 'bin/pix-fb', line 119 of src/fb/CMakeFiles/pix-fb.dir/build.make (continuing)
Build for src/fb/CMakeFiles/pix-fb.dir/build aborted
`src/fb/CMakeFiles/pix-fb.dir/build' not remade because of errors.
[ 81%] Built target pix-fb
make: don't know how to make lib/libtclcad.so.20.0 (prerequisite of: bin/rtwizard)(continuing)
make: don't know how to make lib/libged.so.20.0(continuing)
Build for bin/rtwizard aborted
Build for src/rtwizard/CMakeFiles/rtwizard.dir/build aborted
`src/rtwizard/CMakeFiles/rtwizard.dir/build' not remade because of errors.
[ 81%] Built target rtwizard
make: don't know how to make lib/libtclcad.so.20.0 (prerequisite of: bin/archer)(continuing)
make: don't know how to make lib/libged.so.20.0(continuing)
Build for bin/archer aborted
Build for src/archer/CMakeFiles/archer.dir/build aborted
`src/archer/CMakeFiles/archer.dir/build' not remade because of errors.
[ 81%] Built target archer
[ 81%] Built target cad_boundp
[ 81%] Built target bg_tri_tri_isect
[ 81%] Built target test_nmg_copy
[ 81%] Built target test_diff
[ 81%] Built target test_ssi
[ 81%] Built target test_bundle
[ 81%] �[32m�[1mLinking C executable ../../bin/pixcut�[0m
/usr/bin/ld: cannot find -llibfreetype.so.6
collect2: ld returned 1 exit status
*** Error 1 in target 'bin/pixcut', line 119 of src/util/CMakeFiles/pixcut.dir/build.make (continuing)
Build for src/util/CMakeFiles/pixcut.dir/build aborted
`src/util/CMakeFiles/pixcut.dir/build' not remade because of errors.
[ 81%] Built target pixcut
[ 81%] Built target random
[ 81%] �[32m�[1mLinking C executable ../../bin/pixhist�[0m
/usr/bin/ld: cannot find -llibfreetype.so.6
collect2: ld returned 1 exit status
*** Error 1 in target 'bin/pixhist', line 119 of src/util/CMakeFiles/pixhist.dir/build.make (continuing)
Build for src/util/CMakeFiles/pixhist.dir/build aborted
`src/util/CMakeFiles/pixhist.dir/build' not remade because of errors.
[ 81%] Built target pixhist
[ 82%] �[32mBuilding C object src/proc-db/CMakeFiles/molecule.dir/molecule.c.o�[0m
cc1: warnings being treated as errors
/home/cyapp/brlcad-7.25.0/src/proc-db/molecule.c: In function 'read_data':
/home/cyapp/brlcad-7.25.0/src/proc-db/molecule.c:133: warning: Array size (128) smaller than format string size (129) (arg 2)
*** Error 1 in target 'src/proc-db/CMakeFiles/molecule.dir/molecule.c.o', line 63 of src/proc-db/CMakeFiles/molecule.dir/build.make: cd /home/cyapp/brlcad-7.25.0/build/src/proc-db && /usr/bin/cc  -DBRLCADBUILD=1 -DHAVE_CONFIG_H -DOBJ_BREP=1 -I/home/cyapp/brlcad-7.25.0/build/include -I/home/cyapp/brlcad-7.25.0/include -I/home/cyapp/brlcad-7.25.0/src/other/tcl/generic -I/home/cyapp/brlcad-7.25.0/src/other/tcl/libtommath -I/home/cyapp/brlcad-7.25.0/build/src/other/tcl/include -I/home/cyapp/brlcad-7.25.0/src/other/tcl/unix -I/home/cyapp/brlcad-7.25.0/src/other/tk/generic -I/home/cyapp/brlcad-7.25.0/src/other/openNURBS -I/home/cyapp/brlcad-7.25.0/build/src/other/openNURBS -I/home/cyapp/brlcad-7.25.0/src/other/libz -I/home/cyapp/brlcad-7.25.0/build/src/other/libz -I/home/cyapp/brlcad-7.25.0/src/other/poly2tri -I/home/cyapp/brlcad-7.25.0/src/proc-db  -pipe -fno-strict-aliasing -fno-common -fexceptions -std=gnu89 -m64 -g -ggdb3 -fstack-protector-all -pedantic -pedantic-errors -Wall -Wextra -Wundef -Wfloat-equal -Wshadow -Wbad-function-cast -Wdeclaration-after-statement -Wc++-compat -Winline -Wno-long-long -Wno-variadic-macros -Werror   -o CMakeFiles/molecule.dir/molecule.c.o   -c /home/cyapp/brlcad-7.25.0/src/proc-db/molecule.c (continuing)
Build for src/proc-db/molecule aborted
Build for src/proc-db/CMakeFiles/molecule.dir/build aborted
`src/proc-db/CMakeFiles/molecule.dir/build' not remade because of errors.
[ 82%] Built target molecule
[ 82%] Built target menger
[ 82%] �[32mBuilding C object src/proc-db/CMakeFiles/sphflake.dir/sphflake.c.o�[0m
cc1: warnings being treated as errors
/home/cyapp/brlcad-7.25.0/src/proc-db/sphflake.c: In function 'initializeInfo':
/home/cyapp/brlcad-7.25.0/src/proc-db/sphflake.c:265: warning: Array size (48) smaller than format string size (49) (arg 3)
/home/cyapp/brlcad-7.25.0/src/proc-db/sphflake.c:330: warning: Array size (48) smaller than format string size (49) (arg 3)
/home/cyapp/brlcad-7.25.0/src/proc-db/sphflake.c:342: warning: Array size (48) smaller than format string size (49) (arg 3)
*** Error 1 in target 'src/proc-db/CMakeFiles/sphflake.dir/sphflake.c.o', line 63 of src/proc-db/CMakeFiles/sphflake.dir/build.make: cd /home/cyapp/brlcad-7.25.0/build/src/proc-db && /usr/bin/cc  -DBRLCADBUILD=1 -DHAVE_CONFIG_H -DOBJ_BREP=1 -I/home/cyapp/brlcad-7.25.0/build/include -I/home/cyapp/brlcad-7.25.0/include -I/home/cyapp/brlcad-7.25.0/src/other/tcl/generic -I/home/cyapp/brlcad-7.25.0/src/other/tcl/libtommath -I/home/cyapp/brlcad-7.25.0/build/src/other/tcl/include -I/home/cyapp/brlcad-7.25.0/src/other/tcl/unix -I/home/cyapp/brlcad-7.25.0/src/other/tk/generic -I/home/cyapp/brlcad-7.25.0/src/other/openNURBS -I/home/cyapp/brlcad-7.25.0/build/src/other/openNURBS -I/home/cyapp/brlcad-7.25.0/src/other/libz -I/home/cyapp/brlcad-7.25.0/build/src/other/libz -I/home/cyapp/brlcad-7.25.0/src/other/poly2tri -I/home/cyapp/brlcad-7.25.0/src/proc-db  -pipe -fno-strict-aliasing -fno-common -fexceptions -std=gnu89 -m64 -g -ggdb3 -fstack-protector-all -pedantic -pedantic-errors -Wall -Wextra -Wundef -Wfloat-equal -Wshadow -Wbad-function-cast -Wdeclaration-after-statement -Wc++-compat -Winline -Wno-long-long -Wno-variadic-macros -Werror   -o CMakeFiles/sphflake.dir/sphflake.c.o   -c /home/cyapp/brlcad-7.25.0/src/proc-db/sphflake.c (continuing)
Build for src/proc-db/sphflake aborted
Build for src/proc-db/CMakeFiles/sphflake.dir/build aborted
`src/proc-db/CMakeFiles/sphflake.dir/build' not remade because of errors.
[ 82%] Built target sphflake
[ 82%] Built target tester_icv_fade
[ 82%] Built target tester_icv_filter
[ 82%] Built target test_nmg_mk
[ 83%] Built target rt_pattern
[ 83%] Built target tpkg_c_cp
[ 84%] Built target g-iges
[ 84%] Built target test_bu_datetime
[ 84%] Built target test_bu_file_mime
[ 84%] Built target docbook-docbook-articles-it
[ 84%] �[32m�[1mLinking C executable ../../bin/pixhist3d�[0m
/usr/bin/ld: cannot find -llibfreetype.so.6
collect2: ld returned 1 exit status
*** Error 1 in target 'bin/pixhist3d', line 119 of src/util/CMakeFiles/pixhist3d.dir/build.make (continuing)
Build for src/util/CMakeFiles/pixhist3d.dir/build aborted
`src/util/CMakeFiles/pixhist3d.dir/build' not remade because of errors.
[ 84%] Built target pixhist3d
[ 84%] Built target gencolor
[ 84%] Built target pix-ps
[ 84%] �[32m�[1mLinking C executable ../../bin/double-asc�[0m
/usr/bin/ld: cannot find -llibfreetype.so.6
collect2: ld returned 1 exit status
*** Error 1 in target 'bin/double-asc', line 119 of src/util/CMakeFiles/double-asc.dir/build.make (continuing)
Build for src/util/CMakeFiles/double-asc.dir/build aborted
`src/util/CMakeFiles/double-asc.dir/build' not remade because of errors.
[ 84%] Built target double-asc
[ 84%] Built target sketch
[ 84%] Built target spltest
[ 84%] Built target brep_cube
[ 84%] Built target fftest
[ 84%] Built target PictureTypeD_DATA_cp
[ 84%] Built target tester_sp
[ 86%] Built target iges-g
[ 86%] Built target check-express
[ 86%] �[32m�[1mLinking C executable ../../bin/burst�[0m
/usr/bin/ld: cannot find -llibfreetype.so.6
collect2: ld returned 1 exit status
*** Error 1 in target 'bin/burst', line 521 of src/burst/CMakeFiles/burst.dir/build.make (continuing)
Build for src/burst/CMakeFiles/burst.dir/build aborted
`src/burst/CMakeFiles/burst.dir/build' not remade because of errors.
[ 87%] Built target burst
[ 87%] Built target bwrot
[ 87%] Built target plot3-hpgl
[ 87%] Built target pix-alias
[ 87%] Built target plot3-plot3
[ 87%] �[32m�[1mLinking C executable ../../bin/plot3-fb�[0m
/usr/bin/ld: cannot find -llibfreetype.so.6
collect2: ld returned 1 exit status
*** Error 1 in target 'bin/plot3-fb', line 119 of src/fb/CMakeFiles/plot3-fb.dir/build.make (continuing)
Build for src/fb/CMakeFiles/plot3-fb.dir/build aborted
`src/fb/CMakeFiles/plot3-fb.dir/build' not remade because of errors.
[ 87%] Built target plot3-fb
[ 87%] �[32m�[1mLinking C executable ../../bin/pp-fb�[0m
/usr/bin/ld: cannot find -llibfreetype.so.6
collect2: ld returned 1 exit status
*** Error 1 in target 'bin/pp-fb', line 121 of src/fb/CMakeFiles/pp-fb.dir/build.make (continuing)
Build for src/fb/CMakeFiles/pp-fb.dir/build aborted
`src/fb/CMakeFiles/pp-fb.dir/build' not remade because of errors.
[ 87%] Built target pp-fb
[ 87%] Built target test_bottess
[ 87%] Built target pkg_test_server
[ 87%] Built target pkg_test_client
[ 87%] Built target libgcv_stl
[ 87%] Built target libgcv_decimate
[ 88%] Built target libgcv_fastgen4
[ 88%] Built target libgcv_plugins
[ 88%] Built target gcv
[ 88%] Built target plot3-dm_c_cp
[ 88%] Built target plot3-ps
[ 88%] �[32m�[1mLinking C executable ../../bin/pixhalve�[0m
/usr/bin/ld: cannot find -llibfreetype.so.6
collect2: ld returned 1 exit status
*** Error 1 in target 'bin/pixhalve', line 119 of src/util/CMakeFiles/pixhalve.dir/build.make (continuing)
Build for src/util/CMakeFiles/pixhalve.dir/build aborted
`src/util/CMakeFiles/pixhalve.dir/build' not remade because of errors.
[ 88%] Built target pixhalve
[ 88%] Built target pix3filter
[ 88%] Built target test_bu_badmagic
[ 88%] Built target test_bu_encode
[ 88%] Built target test_bu_dirname
[ 88%] Built target brep_simple
[ 88%] Built target pixbustup
[ 88%] Built target pixsubst
[ 88%] Built target pixembed
[ 88%] Built target pixshrink
make: don't know how to make bin/step-g (prerequisite of: share/db/NIST_MBE_PMI_6.g)(continuing)
Build for share/db/NIST_MBE_PMI_6.g aborted
Build for db/nist/CMakeFiles/NIST_MBE_PMI_6.g aborted
Build for NIST_MBE_PMI_6.g aborted
Build for db/nist/CMakeFiles/NIST_MBE_PMI_6.g.dir/build aborted
`db/nist/CMakeFiles/NIST_MBE_PMI_6.g.dir/build' not remade because of errors.
[ 88%] Built target NIST_MBE_PMI_6.g
make: don't know how to make bin/step-g (prerequisite of: share/db/NIST_MBE_PMI_5.g)(continuing)
Build for share/db/NIST_MBE_PMI_5.g aborted
Build for db/nist/CMakeFiles/NIST_MBE_PMI_5.g aborted
Build for NIST_MBE_PMI_5.g aborted
Build for db/nist/CMakeFiles/NIST_MBE_PMI_5.g.dir/build aborted
`db/nist/CMakeFiles/NIST_MBE_PMI_5.g.dir/build' not remade because of errors.
[ 88%] Built target NIST_MBE_PMI_5.g
make: don't know how to make bin/asc2g (prerequisite of: share/db/kman.g)(continuing)
Build for share/db/kman.g aborted
Build for db/CMakeFiles/kman.g aborted
Build for kman.g aborted
Build for db/CMakeFiles/kman.g.dir/build aborted
`db/CMakeFiles/kman.g.dir/build' not remade because of errors.
[ 88%] Built target kman.g
make: don't know how to make bin/asc2g (prerequisite of: share/db/lgt-test.g)(continuing)
Build for share/db/lgt-test.g aborted
Build for db/CMakeFiles/lgt-test.g aborted
Build for lgt-test.g aborted
Build for db/CMakeFiles/lgt-test.g.dir/build aborted
`db/CMakeFiles/lgt-test.g.dir/build' not remade because of errors.
[ 88%] Built target lgt-test.g
make: don't know how to make bin/asc2g (prerequisite of: share/db/cray.g)(continuing)
Build for share/db/cray.g aborted
Build for db/CMakeFiles/cray.g aborted
Build for cray.g aborted
Build for db/CMakeFiles/cray.g.dir/build aborted
`db/CMakeFiles/cray.g.dir/build' not remade because of errors.
[ 88%] Built target cray.g
make: don't know how to make bin/asc2g (prerequisite of: share/db/goliath.g)(continuing)
Build for share/db/goliath.g aborted
Build for db/CMakeFiles/goliath.g aborted
Build for goliath.g aborted
Build for db/CMakeFiles/goliath.g.dir/build aborted
`db/CMakeFiles/goliath.g.dir/build' not remade because of errors.
[ 88%] Built target goliath.g
[ 88%] �[32m�[1mLinking C executable ../../bin/fb-bw�[0m
/usr/bin/ld: cannot find -llibfreetype.so.6
collect2: ld returned 1 exit status
*** Error 1 in target 'bin/fb-bw', line 119 of src/fb/CMakeFiles/fb-bw.dir/build.make (continuing)
Build for src/fb/CMakeFiles/fb-bw.dir/build aborted
`src/fb/CMakeFiles/fb-bw.dir/build' not remade because of errors.
[ 88%] Built target fb-bw
[ 88%] �[32m�[1mLinking C executable ../../bin/rle-fb�[0m
/usr/bin/ld: cannot find -llibfreetype.so.6
collect2: ld returned 1 exit status
*** Error 1 in target 'bin/rle-fb', line 120 of src/fb/CMakeFiles/rle-fb.dir/build.make (continuing)
Build for src/fb/CMakeFiles/rle-fb.dir/build aborted
`src/fb/CMakeFiles/rle-fb.dir/build' not remade because of errors.
[ 88%] Built target rle-fb
[ 88%] Built target nmg-rib
[ 88%] Built target caf9c66ac6265db364c5e05be12c0bd7_cp
[ 88%] Built target archer_wizard_FILES_cp
[ 88%] Built target plugins_Commands_README_cp
[ 88%] Built target manuals_mged_animmate_HTML_cp
[ 88%] Built target ReleaseNotes_Rel6_0_index_html_cp
[ 94%] Built target docbook-docbook-system-mann
[ 94%] Built target docbook-docbook-specifications-en
[ 94%] Built target docbook-docbook-books-en-3
[ 94%] Built target docbook-docbook-books-en-1
[ 94%] Built target docbook
[ 94%] Built target pixuntile
[ 94%] Built target pixfilter
[ 94%] Built target imod
[ 94%] Built target bw-d
[ 94%] �[32m�[1mLinking C executable ../../bin/ddisp�[0m
/usr/bin/ld: cannot find -llibfreetype.so.6
collect2: ld returned 1 exit status
*** Error 1 in target 'bin/ddisp', line 119 of src/sig/CMakeFiles/ddisp.dir/build.make (continuing)
Build for src/sig/CMakeFiles/ddisp.dir/build aborted
`src/sig/CMakeFiles/ddisp.dir/build' not remade because of errors.
[ 94%] Built target ddisp
[ 94%] �[32mBuilding C object src/rt/CMakeFiles/rtsil.dir/do.c.o�[0m
cc1: warnings being treated as errors
/home/cyapp/brlcad-7.25.0/src/rt/do.c: In function 'old_frame':
/home/cyapp/brlcad-7.25.0/src/rt/do.c:96: warning: Array size (128) smaller than format string size (129) (arg 3)
/home/cyapp/brlcad-7.25.0/src/rt/do.c:98: warning: Array size (128) smaller than format string size (129) (arg 3)
/home/cyapp/brlcad-7.25.0/src/rt/do.c:100: warning: Array size (128) smaller than format string size (129) (arg 3)
/home/cyapp/brlcad-7.25.0/src/rt/do.c:102: warning: Array size (128) smaller than format string size (129) (arg 3)
/home/cyapp/brlcad-7.25.0/src/rt/do.c:105: warning: Array size (128) smaller than format string size (129) (arg 3)
*** Error 1 in target 'src/rt/CMakeFiles/rtsil.dir/do.c.o', line 63 of src/rt/CMakeFiles/rtsil.dir/build.make: cd /home/cyapp/brlcad-7.25.0/build/src/rt && /usr/bin/cc  -DBRLCADBUILD=1 -DHAVE_CONFIG_H -I/home/cyapp/brlcad-7.25.0/build/include -I/home/cyapp/brlcad-7.25.0/include -I/home/cyapp/brlcad-7.25.0/src/other/tcl/generic -I/home/cyapp/brlcad-7.25.0/src/other/tcl/libtommath -I/home/cyapp/brlcad-7.25.0/build/src/other/tcl/include -I/home/cyapp/brlcad-7.25.0/src/other/tcl/unix -I/home/cyapp/brlcad-7.25.0/src/other/tk/generic -I/home/cyapp/brlcad-7.25.0/src/other/openNURBS -I/home/cyapp/brlcad-7.25.0/build/src/other/openNURBS -I/home/cyapp/brlcad-7.25.0/src/other/libz -I/home/cyapp/brlcad-7.25.0/build/src/other/libz -I/home/cyapp/brlcad-7.25.0/src/other/poly2tri -I/usr/X11R6/include -I/home/cyapp/brlcad-7.25.0/src/rt  -pipe -fno-strict-aliasing -fno-common -fexceptions -std=gnu89 -m64 -g -ggdb3 -fstack-protector-all -pedantic -pedantic-errors -Wall -Wextra -Wundef -Wfloat-equal -Wshadow -Wbad-function-cast -Wdeclaration-after-statement -Wc++-compat -Winline -Wno-long-long -Wno-variadic-macros -Werror   -o CMakeFiles/rtsil.dir/do.c.o   -c /home/cyapp/brlcad-7.25.0/src/rt/do.c (continuing)
Build for bin/rtsil aborted
Build for src/rt/CMakeFiles/rtsil.dir/build aborted
`src/rt/CMakeFiles/rtsil.dir/build' not remade because of errors.
[ 94%] Built target rtsil
[ 94%] �[32m�[1mLinking C executable ../../bin/reshoot�[0m
/usr/bin/ld: cannot find -llibfreetype.so.6
collect2: ld returned 1 exit status
*** Error 1 in target 'bin/reshoot', line 132 of src/rt/CMakeFiles/reshoot.dir/build.make (continuing)
Build for src/rt/CMakeFiles/reshoot.dir/build aborted
`src/rt/CMakeFiles/reshoot.dir/build' not remade because of errors.
[ 94%] Built target reshoot
[ 94%] �[32mBuilding C object src/rt/CMakeFiles/rtfrac.dir/do.c.o�[0m
cc1: warnings being treated as errors
/home/cyapp/brlcad-7.25.0/src/rt/do.c: In function 'old_frame':
/home/cyapp/brlcad-7.25.0/src/rt/do.c:96: warning: Array size (128) smaller than format string size (129) (arg 3)
/home/cyapp/brlcad-7.25.0/src/rt/do.c:98: warning: Array size (128) smaller than format string size (129) (arg 3)
/home/cyapp/brlcad-7.25.0/src/rt/do.c:100: warning: Array size (128) smaller than format string size (129) (arg 3)
/home/cyapp/brlcad-7.25.0/src/rt/do.c:102: warning: Array size (128) smaller than format string size (129) (arg 3)
/home/cyapp/brlcad-7.25.0/src/rt/do.c:105: warning: Array size (128) smaller than format string size (129) (arg 3)
*** Error 1 in target 'src/rt/CMakeFiles/rtfrac.dir/do.c.o', line 63 of src/rt/CMakeFiles/rtfrac.dir/build.make: cd /home/cyapp/brlcad-7.25.0/build/src/rt && /usr/bin/cc  -DBRLCADBUILD=1 -DHAVE_CONFIG_H -I/home/cyapp/brlcad-7.25.0/build/include -I/home/cyapp/brlcad-7.25.0/include -I/home/cyapp/brlcad-7.25.0/src/other/tcl/generic -I/home/cyapp/brlcad-7.25.0/src/other/tcl/libtommath -I/home/cyapp/brlcad-7.25.0/build/src/other/tcl/include -I/home/cyapp/brlcad-7.25.0/src/other/tcl/unix -I/home/cyapp/brlcad-7.25.0/src/other/tk/generic -I/home/cyapp/brlcad-7.25.0/src/other/openNURBS -I/home/cyapp/brlcad-7.25.0/build/src/other/openNURBS -I/home/cyapp/brlcad-7.25.0/src/other/libz -I/home/cyapp/brlcad-7.25.0/build/src/other/libz -I/home/cyapp/brlcad-7.25.0/src/other/poly2tri -I/usr/X11R6/include -I/home/cyapp/brlcad-7.25.0/src/rt  -pipe -fno-strict-aliasing -fno-common -fexceptions -std=gnu89 -m64 -g -ggdb3 -fstack-protector-all -pedantic -pedantic-errors -Wall -Wextra -Wundef -Wfloat-equal -Wshadow -Wbad-function-cast -Wdeclaration-after-statement -Wc++-compat -Winline -Wno-long-long -Wno-variadic-macros -Werror   -o CMakeFiles/rtfrac.dir/do.c.o   -c /home/cyapp/brlcad-7.25.0/src/rt/do.c (continuing)
Build for bin/rtfrac aborted
Build for src/rt/CMakeFiles/rtfrac.dir/build aborted
`src/rt/CMakeFiles/rtfrac.dir/build' not remade because of errors.
[ 94%] Built target rtfrac
[ 94%] Built target roots_example_c_cp
[ 94%] �[32m�[1mLinking C executable ../../bin/texturescale�[0m
/usr/bin/ld: cannot find -llibfreetype.so.6
collect2: ld returned 1 exit status
*** Error 1 in target 'bin/texturescale', line 120 of src/util/CMakeFiles/texturescale.dir/build.make (continuing)
Build for src/util/CMakeFiles/texturescale.dir/build aborted
`src/util/CMakeFiles/texturescale.dir/build' not remade because of errors.
[ 94%] Built target texturescale
[ 94%] Built target png-bw
[ 94%] Built target pixcrop
[ 94%] Built target test_bu_str_isprint
[ 94%] Built target test_bu_vls_vprintf
[ 94%] Built target manuals_HTML_cp
[ 94%] Built target libdm_HTML_cp
[ 94%] Built target chan_add
[ 94%] Built target tester_raydiff
[ 94%] Built target bg_chull
[ 94%] Built target anim_time
[ 94%] Built target kurt
[ 94%] Built target showshot
Warning: target lib/libremrt.a (prerequisite of: bin/rtsrv) does not have any command (BUG)
[ 94%] �[32m�[1mLinking C executable ../../bin/rtsrv�[0m
cc: ../../lib/libremrt.a: No such file or directory
*** Error 1 in target 'bin/rtsrv', line 133 of src/remrt/CMakeFiles/rtsrv.dir/build.make (continuing)
Build for src/remrt/CMakeFiles/rtsrv.dir/build aborted
`src/remrt/CMakeFiles/rtsrv.dir/build' not remade because of errors.
[ 94%] Built target rtsrv
[ 94%] �[32m�[1mLinking C executable ../../bin/fbgrid�[0m
/usr/bin/ld: cannot find -llibfreetype.so.6
collect2: ld returned 1 exit status
*** Error 1 in target 'bin/fbgrid', line 119 of src/fb/CMakeFiles/fbgrid.dir/build.make (continuing)
Build for src/fb/CMakeFiles/fbgrid.dir/build aborted
`src/fb/CMakeFiles/fbgrid.dir/build' not remade because of errors.
[ 94%] Built target fbgrid
[ 94%] �[32m�[1mLinking C executable ../../bin/fbhelp�[0m
/usr/bin/ld: cannot find -llibfreetype.so.6
collect2: ld returned 1 exit status
*** Error 1 in target 'bin/fbhelp', line 119 of src/fb/CMakeFiles/fbhelp.dir/build.make (continuing)
Build for src/fb/CMakeFiles/fbhelp.dir/build aborted
`src/fb/CMakeFiles/fbhelp.dir/build' not remade because of errors.
[ 94%] Built target fbhelp
[ 94%] �[32m�[1mLinking C executable ../../bin/fbframe�[0m
/usr/bin/ld: cannot find -llibfreetype.so.6
collect2: ld returned 1 exit status
*** Error 1 in target 'bin/fbframe', line 119 of src/fb/CMakeFiles/fbframe.dir/build.make (continuing)
Build for src/fb/CMakeFiles/fbframe.dir/build aborted
`src/fb/CMakeFiles/fbframe.dir/build' not remade because of errors.
[ 94%] Built target fbframe
[ 94%] �[32m�[1mLinking C executable ../../bin/fb-cmap�[0m
/usr/bin/ld: cannot find -llibfreetype.so.6
collect2: ld returned 1 exit status
*** Error 1 in target 'bin/fb-cmap', line 119 of src/fb/CMakeFiles/fb-cmap.dir/build.make (continuing)
Build for src/fb/CMakeFiles/fb-cmap.dir/build aborted
`src/fb/CMakeFiles/fb-cmap.dir/build' not remade because of errors.
[ 94%] Built target fb-cmap
[ 94%] Built target chan_mult
[ 95%] Built target anim_keyread
[ 95%] Built target g-egg
[ 95%] Built target shp-g
[ 95%] Built target walk_example_c_cp
[ 95%] Built target u-bw
[ 95%] Built target d-f
[ 95%] Built target dconv
[ 95%] Built target u-a
[ 95%] �[32mBuilding C object src/remrt/CMakeFiles/remrt.dir/remrt.c.o�[0m
cc1: warnings being treated as errors
/home/cyapp/brlcad-7.25.0/src/remrt/remrt.c: In function 'read_matrix':
/home/cyapp/brlcad-7.25.0/src/remrt/remrt.c:834: warning: Array size (128) smaller than format string size (129) (arg 3)
/home/cyapp/brlcad-7.25.0/src/remrt/remrt.c:839: warning: Array size (128) smaller than format string size (129) (arg 3)
/home/cyapp/brlcad-7.25.0/src/remrt/remrt.c:848: warning: Array size (128) smaller than format string size (129) (arg 3)
/home/cyapp/brlcad-7.25.0/src/remrt/remrt.c: In function 'host_helper':
/home/cyapp/brlcad-7.25.0/src/remrt/remrt.c:3374: warning: Array size (128) smaller than format string size (129) (arg 3)
/home/cyapp/brlcad-7.25.0/src/remrt/remrt.c:3374: warning: Array size (128) smaller than format string size (129) (arg 5)
/home/cyapp/brlcad-7.25.0/src/remrt/remrt.c:3374: warning: Array size (128) smaller than format string size (129) (arg 6)
/home/cyapp/brlcad-7.25.0/src/remrt/remrt.c:3374: warning: Array size (128) smaller than format string size (129) (arg 7)
*** Error 1 in target 'src/remrt/CMakeFiles/remrt.dir/remrt.c.o', line 87 of src/remrt/CMakeFiles/remrt.dir/build.make: cd /home/cyapp/brlcad-7.25.0/build/src/remrt && /usr/bin/cc  -DBRLCADBUILD=1 -DHAVE_CONFIG_H -I/home/cyapp/brlcad-7.25.0/build/include -I/home/cyapp/brlcad-7.25.0/include -I/home/cyapp/brlcad-7.25.0/src/other/tcl/generic -I/home/cyapp/brlcad-7.25.0/src/other/tcl/libtommath -I/home/cyapp/brlcad-7.25.0/build/src/other/tcl/include -I/home/cyapp/brlcad-7.25.0/src/other/tcl/unix -I/home/cyapp/brlcad-7.25.0/src/other/tk/generic -I/home/cyapp/brlcad-7.25.0/src/other/openNURBS -I/home/cyapp/brlcad-7.25.0/build/src/other/openNURBS -I/home/cyapp/brlcad-7.25.0/src/other/libz -I/home/cyapp/brlcad-7.25.0/build/src/other/libz -I/home/cyapp/brlcad-7.25.0/src/other/poly2tri -I/usr/X11R6/include -I/home/cyapp/brlcad-7.25.0/src/remrt  -pipe -fno-strict-aliasing -fno-common -fexceptions -std=gnu89 -m64 -g -ggdb3 -fstack-protector-all -pedantic -pedantic-errors -Wall -Wextra -Wundef -Wfloat-equal -Wshadow -Wbad-function-cast -Wdeclaration-after-statement -Wc++-compat -Winline -Wno-long-long -Wno-variadic-macros -Werror   -o CMakeFiles/remrt.dir/remrt.c.o   -c /home/cyapp/brlcad-7.25.0/src/remrt/remrt.c (continuing)
Warning: target lib/libremrt.a does not have any command (BUG)
Build for bin/remrt aborted
Build for src/remrt/CMakeFiles/remrt.dir/build aborted
`src/remrt/CMakeFiles/remrt.dir/build' not remade because of errors.
[ 95%] Built target remrt
[ 95%] Built target pixtile
[ 95%] Built target bwthresh
[ 95%] Built target asc-plot3
[ 95%] Built target bwhisteq
[ 95%] Built target xyz-plot3
[ 95%] �[32m�[1mLinking C executable ../../bin/pixborder�[0m
/usr/bin/ld: cannot find -llibfreetype.so.6
collect2: ld returned 1 exit status
*** Error 1 in target 'bin/pixborder', line 120 of src/util/CMakeFiles/pixborder.dir/build.make (continuing)
Build for src/util/CMakeFiles/pixborder.dir/build aborted
`src/util/CMakeFiles/pixborder.dir/build' not remade because of errors.
[ 95%] Built target pixborder
[ 95%] Built target tester_icv_saturate
[ 95%] Built target tester_icv_rect
[ 95%] Built target tester_icv_crop
make: don't know how to make bin/asc2g (prerequisite of: share/db/cube.g)(continuing)
Build for share/db/cube.g aborted
Build for db/CMakeFiles/cube.g aborted
Build for cube.g aborted
Build for db/CMakeFiles/cube.g.dir/build aborted
`db/CMakeFiles/cube.g.dir/build' not remade because of errors.
[ 95%] Built target cube.g
[ 95%] Built target wish
[ 95%] Built target g-voxel
[ 95%] Built target jack-g
[ 95%] Built target g4-g5
make: don't know how to make lib/libged.so.20.0 (prerequisite of: bin/g-dot)(continuing)
Build for bin/g-dot aborted
Build for src/conv/CMakeFiles/g-dot.dir/build aborted
`src/conv/CMakeFiles/g-dot.dir/build' not remade because of errors.
[ 95%] Built target g-dot
[ 95%] Built target PictureTypeF_DATA_cp
[ 95%] Built target pixfade
make: don't know how to make lib/libtclcad.so.20.0 (prerequisite of: bin/bombardier)(continuing)
make: don't know how to make lib/libged.so.20.0(continuing)
Build for bin/bombardier aborted
Build for src/util/CMakeFiles/bombardier.dir/build aborted
`src/util/CMakeFiles/bombardier.dir/build' not remade because of errors.
[ 95%] Built target bombardier
[ 95%] Built target pixhist3d-plot3
[ 95%] Built target bg_polygon_triangulate
[ 95%] Built target tester_bn_plane_isect
[ 95%] Built target tester_density
[ 95%] Built target nurbs_tester
[ 95%] Built target test_bu_escape
make: don't know how to make bin/asc2g (prerequisite of: share/db/castle.g)(continuing)
Build for share/db/castle.g aborted
Build for db/CMakeFiles/castle.g aborted
Build for castle.g aborted
Build for db/CMakeFiles/castle.g.dir/build aborted
`db/CMakeFiles/castle.g.dir/build' not remade because of errors.
[ 95%] Built target castle.g
make: don't know how to make bin/asc2g (prerequisite of: share/db/boolean-ops.g)(continuing)
Build for share/db/boolean-ops.g aborted
Build for db/CMakeFiles/boolean-ops.g aborted
Build for boolean-ops.g aborted
Build for db/CMakeFiles/boolean-ops.g.dir/build aborted
`db/CMakeFiles/boolean-ops.g.dir/build' not remade because of errors.
[ 95%] Built target boolean-ops.g
make: don't know how to make bin/asc2g (prerequisite of: share/db/cornell-kunigami.g)(continuing)
Build for share/db/cornell-kunigami.g aborted
Build for db/CMakeFiles/cornell-kunigami.g aborted
Build for cornell-kunigami.g aborted
Build for db/CMakeFiles/cornell-kunigami.g.dir/build aborted
`db/CMakeFiles/cornell-kunigami.g.dir/build' not remade because of errors.
[ 95%] Built target cornell-kunigami.g
make: don't know how to make bin/asc2g (prerequisite of: share/db/operators.g)(continuing)
Build for share/db/operators.g aborted
Build for db/CMakeFiles/operators.g aborted
Build for operators.g aborted
Build for db/CMakeFiles/operators.g.dir/build aborted
`db/CMakeFiles/operators.g.dir/build' not remade because of errors.
[ 95%] Built target operators.g
[ 95%] �[32m�[1mLinking C executable fbthreadtest�[0m
/usr/bin/ld: cannot find -llibfreetype.so.6
collect2: ld returned 1 exit status
*** Error 1 in target 'src/fb/tests/fbthreadtest', line 119 of src/fb/tests/CMakeFiles/fbthreadtest.dir/build.make (continuing)
Build for src/fb/tests/CMakeFiles/fbthreadtest.dir/build aborted
`src/fb/tests/CMakeFiles/fbthreadtest.dir/build' not remade because of errors.
[ 95%] Built target fbthreadtest
[ 96%] Built target utahrle-static
[ 96%] Built target wavy
[ 96%] Built target tube
[ 96%] Built target breplicator
[ 96%] Built target asc2dsp
[ 96%] Built target g-obj
[ 96%] Built target enf-g
[ 96%] Built target g-tankill
[ 96%] Built target g-stl
[ 96%] Built target wdb_example
[ 96%] Built target cchannel
[ 96%] Built target test_bu_heap
[ 96%] Built target test_bu_bitv
[ 96%] Built target test_bu_color
[ 96%] Built target ADA073408.g
[ 96%] Built target u-d
[ 96%] Built target istats
[ 96%] Built target f-i
[ 96%] Built target f-d
[ 96%] Built target example
make: don't know how to make bin/asc2g (prerequisite of: share/db/star.g)(continuing)
Build for share/db/star.g aborted
Build for db/CMakeFiles/star.g aborted
Build for star.g aborted
Build for db/CMakeFiles/star.g.dir/build aborted
`db/CMakeFiles/star.g.dir/build' not remade because of errors.
[ 96%] Built target star.g
[ 96%] Built target terra_dsp_cp
[ 96%] Built target firpass
[ 96%] Built target irdisp
[ 96%] �[32m�[1mLinking C executable ../../bin/lgt�[0m
/usr/bin/ld: cannot find -llibfreetype.so.6
collect2: ld returned 1 exit status
*** Error 1 in target 'bin/lgt', line 548 of src/lgt/CMakeFiles/lgt.dir/build.make (continuing)
Build for src/lgt/CMakeFiles/lgt.dir/build aborted
`src/lgt/CMakeFiles/lgt.dir/build' not remade because of errors.
[ 97%] Built target lgt
[ 97%] Built target step-express-CONFIG_CONTROL_DESIGN-gstep
[ 97%] Built target g-step
[ 97%] Built target step-express-CONFIG_CONTROL_DESIGN-list_elements
[ 97%] Built target list_elements
[ 97%] Built target tkhtml_n_gen
[ 97%] Built target i-d
[ 97%] Built target umod
make: don't know how to make lib/libged.so.20.0 (prerequisite of: bin/coil)(continuing)
Build for bin/coil aborted
Build for src/shapes/CMakeFiles/coil.dir/build aborted
`src/shapes/CMakeFiles/coil.dir/build' not remade because of errors.
[ 97%] Built target coil
[ 97%] Built target nsis_archer_ico_cp
[ 97%] Built target rtexample_c_cp
[ 97%] �[32m�[1mLinking C executable rtexample�[0m
/usr/bin/ld: cannot find -llibfreetype.so.6
collect2: ld returned 1 exit status
*** Error 1 in target 'src/rt/rtexample', line 132 of src/rt/CMakeFiles/rtexample.dir/build.make (continuing)
Build for src/rt/CMakeFiles/rtexample.dir/build aborted
`src/rt/CMakeFiles/rtexample.dir/build' not remade because of errors.
[ 97%] Built target rtexample
[ 97%] Built target tester_bn_poly_multiply
[ 97%] Built target PictureTypeC_DATA_cp
[ 97%] �[32m�[1mLinking C executable ../../bin/halftone�[0m
/usr/bin/ld: cannot find -llibfreetype.so.6
collect2: ld returned 1 exit status
*** Error 1 in target 'bin/halftone', line 285 of src/halftone/CMakeFiles/halftone.dir/build.make (continuing)
Build for src/halftone/CMakeFiles/halftone.dir/build aborted
`src/halftone/CMakeFiles/halftone.dir/build' not remade because of errors.
[ 97%] Built target halftone
[ 97%] �[32mBuilding C object src/rt/CMakeFiles/rtray.dir/do.c.o�[0m
cc1: warnings being treated as errors
/home/cyapp/brlcad-7.25.0/src/rt/do.c: In function 'old_frame':
/home/cyapp/brlcad-7.25.0/src/rt/do.c:96: warning: Array size (128) smaller than format string size (129) (arg 3)
/home/cyapp/brlcad-7.25.0/src/rt/do.c:98: warning: Array size (128) smaller than format string size (129) (arg 3)
/home/cyapp/brlcad-7.25.0/src/rt/do.c:100: warning: Array size (128) smaller than format string size (129) (arg 3)
/home/cyapp/brlcad-7.25.0/src/rt/do.c:102: warning: Array size (128) smaller than format string size (129) (arg 3)
/home/cyapp/brlcad-7.25.0/src/rt/do.c:105: warning: Array size (128) smaller than format string size (129) (arg 3)
*** Error 1 in target 'src/rt/CMakeFiles/rtray.dir/do.c.o', line 63 of src/rt/CMakeFiles/rtray.dir/build.make: cd /home/cyapp/brlcad-7.25.0/build/src/rt && /usr/bin/cc  -DBRLCADBUILD=1 -DHAVE_CONFIG_H -I/home/cyapp/brlcad-7.25.0/build/include -I/home/cyapp/brlcad-7.25.0/include -I/home/cyapp/brlcad-7.25.0/src/other/tcl/generic -I/home/cyapp/brlcad-7.25.0/src/other/tcl/libtommath -I/home/cyapp/brlcad-7.25.0/build/src/other/tcl/include -I/home/cyapp/brlcad-7.25.0/src/other/tcl/unix -I/home/cyapp/brlcad-7.25.0/src/other/tk/generic -I/home/cyapp/brlcad-7.25.0/src/other/openNURBS -I/home/cyapp/brlcad-7.25.0/build/src/other/openNURBS -I/home/cyapp/brlcad-7.25.0/src/other/libz -I/home/cyapp/brlcad-7.25.0/build/src/other/libz -I/home/cyapp/brlcad-7.25.0/src/other/poly2tri -I/usr/X11R6/include -I/home/cyapp/brlcad-7.25.0/src/rt  -pipe -fno-strict-aliasing -fno-common -fexceptions -std=gnu89 -m64 -g -ggdb3 -fstack-protector-all -pedantic -pedantic-errors -Wall -Wextra -Wundef -Wfloat-equal -Wshadow -Wbad-function-cast -Wdeclaration-after-statement -Wc++-compat -Winline -Wno-long-long -Wno-variadic-macros -Werror   -o CMakeFiles/rtray.dir/do.c.o   -c /home/cyapp/brlcad-7.25.0/src/rt/do.c (continuing)
Build for bin/rtray aborted
Build for src/rt/CMakeFiles/rtray.dir/build aborted
`src/rt/CMakeFiles/rtray.dir/build' not remade because of errors.
[ 97%] Built target rtray
[ 97%] �[32m�[1mLinking C executable ../../bin/gif-fb�[0m
/usr/bin/ld: cannot find -llibfreetype.so.6
collect2: ld returned 1 exit status
*** Error 1 in target 'bin/gif-fb', line 145 of src/fb/CMakeFiles/gif-fb.dir/build.make (continuing)
Build for src/fb/CMakeFiles/gif-fb.dir/build aborted
`src/fb/CMakeFiles/gif-fb.dir/build' not remade because of errors.
[ 97%] Built target gif-fb
[ 97%] Built target f796b3e43eccf39b605762cebc3e428a_cp
[ 97%] Built target anim_cascade
[ 97%] Built target anim_script
[ 97%] Built target euclid_unformat
[ 97%] Built target conv-vg2g
[ 97%] Built target pixdsplit
[ 97%] Built target pixdiff
[ 97%] �[32m�[1mLinking C executable ../../bin/bwhist�[0m
/usr/bin/ld: cannot find -llibfreetype.so.6
collect2: ld returned 1 exit status
*** Error 1 in target 'bin/bwhist', line 119 of src/util/CMakeFiles/bwhist.dir/build.make (continuing)
Build for src/util/CMakeFiles/bwhist.dir/build aborted
`src/util/CMakeFiles/bwhist.dir/build' not remade because of errors.
[ 97%] Built target bwhist
[ 97%] Built target bary
[ 98%] Built target terrain
[ 98%] �[32m�[1mLinking C executable ../../bin/pixbgstrip�[0m
/usr/bin/ld: cannot find -llibfreetype.so.6
collect2: ld returned 1 exit status
*** Error 1 in target 'bin/pixbgstrip', line 119 of src/util/CMakeFiles/pixbgstrip.dir/build.make (continuing)
Build for src/util/CMakeFiles/pixbgstrip.dir/build aborted
`src/util/CMakeFiles/pixbgstrip.dir/build' not remade because of errors.
[ 98%] Built target pixbgstrip
[ 98%] �[32m�[1mLinking C executable ../../bin/pixpaste�[0m
/usr/bin/ld: cannot find -llibfreetype.so.6
collect2: ld returned 1 exit status
*** Error 1 in target 'bin/pixpaste', line 119 of src/util/CMakeFiles/pixpaste.dir/build.make (continuing)
Build for src/util/CMakeFiles/pixpaste.dir/build aborted
`src/util/CMakeFiles/pixpaste.dir/build' not remade because of errors.
[ 98%] Built target pixpaste
[ 98%] �[32m�[1mLinking C executable ../../bin/wavelet�[0m
/usr/bin/ld: cannot find -llibfreetype.so.6
collect2: ld returned 1 exit status
*** Error 1 in target 'bin/wavelet', line 120 of src/util/CMakeFiles/wavelet.dir/build.make (continuing)
Build for src/util/CMakeFiles/wavelet.dir/build aborted
`src/util/CMakeFiles/wavelet.dir/build' not remade because of errors.
[ 98%] Built target wavelet
[ 98%] Built target bwshrink
[ 98%] �[32mBuilding C object src/util/CMakeFiles/plot3rot.dir/plot3rot.c.o�[0m
cc1: warnings being treated as errors
/home/cyapp/brlcad-7.25.0/src/util/plot3rot.c: In function 'two_dcoord_out':
/home/cyapp/brlcad-7.25.0/src/util/plot3rot.c:602: warning: array size (16) smaller than required length (24 * 1)
/home/cyapp/brlcad-7.25.0/src/util/plot3rot.c:602: warning: array size (16) smaller than required length (24 * 1)
*** Error 1 in target 'src/util/CMakeFiles/plot3rot.dir/plot3rot.c.o', line 63 of src/util/CMakeFiles/plot3rot.dir/build.make: cd /home/cyapp/brlcad-7.25.0/build/src/util && /usr/bin/cc  -DBRLCADBUILD=1 -DHAVE_CONFIG_H -I/home/cyapp/brlcad-7.25.0/src/util -I/home/cyapp/brlcad-7.25.0/build/include -I/home/cyapp/brlcad-7.25.0/include -isystem /home/cyapp/brlcad-7.25.0/build/src/other/tcl/include -isystem /home/cyapp/brlcad-7.25.0/build/src/other/openNURBS -isystem /home/cyapp/brlcad-7.25.0/build/src/other/libz -isystem /home/cyapp/brlcad-7.25.0/build/src/other/libpng -isystem /home/cyapp/brlcad-7.25.0/src/other/tcl/generic -isystem /home/cyapp/brlcad-7.25.0/src/other/tcl/libtommath -isystem /home/cyapp/brlcad-7.25.0/src/other/tcl/unix -isystem /home/cyapp/brlcad-7.25.0/src/other/tk/generic -isystem /home/cyapp/brlcad-7.25.0/src/other/openNURBS -isystem /home/cyapp/brlcad-7.25.0/src/other/libz -isystem /home/cyapp/brlcad-7.25.0/src/other/poly2tri -isystem /home/cyapp/brlcad-7.25.0/src/other/libutahrle/include -isystem /home/cyapp/brlcad-7.25.0/src/other/libpng -isystem /usr/X11R6/include  -pipe -fno-strict-aliasing -fno-common -fexceptions -std=gnu89 -m64 -g -ggdb3 -fstack-protector-all -pedantic -pedantic-errors -Wall -Wextra -Wundef -Wfloat-equal -Wshadow -Wbad-function-cast -Wdeclaration-after-statement -Wc++-compat -Winline -Wno-long-long -Wno-variadic-macros -Werror   -o CMakeFiles/plot3rot.dir/plot3rot.c.o   -c /home/cyapp/brlcad-7.25.0/src/util/plot3rot.c (continuing)
Build for bin/plot3rot aborted
Build for src/util/CMakeFiles/plot3rot.dir/build aborted
`src/util/CMakeFiles/plot3rot.dir/build' not remade because of errors.
[ 98%] Built target plot3rot
[ 98%] �[32m�[1mLinking C executable ../../bin/pixmorph�[0m
/usr/bin/ld: cannot find -llibfreetype.so.6
collect2: ld returned 1 exit status
*** Error 1 in target 'bin/pixmorph', line 119 of src/util/CMakeFiles/pixmorph.dir/build.make (continuing)
Build for src/util/CMakeFiles/pixmorph.dir/build aborted
`src/util/CMakeFiles/pixmorph.dir/build' not remade because of errors.
[100%] Built target pixmorph
[100%] Built target g-shell-rect
[100%] Built target g5-g4
[100%] Built target csgbrep
[100%] Built target mkbuilding
[100%] Built target tester_icv_size_down
[100%] Built target tester_icv_read_write
[100%] Built target sun-pix
[100%] Built target admin-db
[100%] Built target azel
[100%] Built target pixscale
Done.

BRL-CAD Release 7.25.0, Build 20160501

Elapsed compilation time: 40 seconds 
Elapsed time since configuration: 8 hours 33 minutes 49 seconds 
---
Run 'make install' to begin installation into /usr/brlcad/dev-7.25.0
Run 'make benchmark' to run the BRL-CAD Benchmark Suite

[100%] Built target buildtimedelta
$ exit


Script done on Sun May  1 08:42:35 2016